program: Orca
programVersion: 5.0.4
elementType: S P O O O O N C C C C C C C C C C C H H H H H H H H H H H H H H H H
charge: 0
multiplicity: 1
keywords: wb97x-d3
keywords: def2-TZVPP
keywords: def2/J RIJCOSX
keywords: DEFGRID2
keywords: scfconv7
keywords: smallprint printgap noloewdin
keywords: NOSOSCF
formula: C11H16NO4PS
InChI: InChI=1/C11H16NO4PS/c1-8(2)15-11(13)9-6-4-5-7-10(9)16-17(12,18)14-3/h4-8H,12H2,1-3H3
34 atoms
S  -3.831215 0.334242 0.599052
P  -2.209792 -0.657207 0.332759
O  2.978301 -0.21113 -0.319057
O  -1.014922 0.080532 -0.50991
O  -2.34048 -1.958966 -0.593942
O  1.21141 -1.368956 0.399804
N  -1.466448 -1.13214 1.708359
C  3.79455 -1.397779 -0.379828
C  1.061215 1.009353 0.178177
C  -0.308335 1.151793 -0.059659
C  1.723751 -0.319954 0.098363
C  3.533749 -2.145569 -1.674052
C  5.229913 -0.928795 -0.257396
C  1.801645 2.141119 0.518327
C  -0.920994 2.391221 0.060049
C  1.190678 3.373329 0.661869
C  -0.171801 3.494224 0.431986
C  -2.991399 -1.88826 -1.853873
H  3.545045 -2.040926 0.467831
H  2.503078 -2.489782 -1.740681
H  3.749599 -1.517294 -2.539276
H  4.1789 -3.022969 -1.728613
H  5.507754 -0.274461 -1.084521
H  5.901031 -1.787395 -0.269825
H  5.39552 -0.391332 0.676239
H  2.865265 2.051141 0.68892
H  -1.979142 2.480749 -0.143743
H  1.776641 4.237347 0.943365
H  -0.657079 4.45593 0.532507
H  -0.565217 -1.585867 1.665915
H  -2.019651 -1.275338 2.534097
H  -3.149425 -2.911004 -2.188633
H  -2.375234 -1.366545 -2.588358
H  -3.95597 -1.383344 -1.773615
totalener: -1524.22376150 hartree
nucrepener: 1692.09754393 hartree
electener: -3216.32130543 hartree
oneelecener: -5457.54727050 hartree
twoeener: 2241.22596507 hartree
kineticenergy: 1519.45703358 hartree
xcener: -110.328108696163 hartree
chargesum: -0.0000000
charge: -0.412625 0.664096 -0.274394 -0.338854 -0.316684 -0.424682 -0.329667 0.148653 -0.007116 0.159916 0.489497 -0.260433 -0.233205 -0.159947 -0.114850 -0.134824 -0.112815 -0.118883 0.059311 0.106364 0.085319 0.083122 0.086056 0.083502 0.089320 0.119825 0.131349 0.126406 0.130601 0.192639 0.155174 0.113876 0.110808 0.103148
qa: -0.4126 0.6641 -0.2744 -0.3389 -0.3167 -0.4247 -0.3297 0.1487 -0.0071 0.1599 0.4895 -0.2604 -0.2332 -0.1599 -0.1149 -0.1348 -0.1128 -0.1189 0.0593 0.1064 0.0853 0.0831 0.0861 0.0835 0.0893 0.1198 0.1313 0.1264 0.1306 0.1926 0.1552 0.1139 0.1108 0.1031
va: 2.0387 5.4821 2.1472 2.1100 2.0990 2.0514 3.1455 3.8454 3.7012 4.0011 4.0547 3.9150 3.9244 4.0441 3.9931 3.9576 3.9823 3.8651 1.0250 1.0171 1.0081 1.0090 1.0090 1.0092 1.0098 1.0223 1.0269 1.0018 0.9989 1.0326 1.0351 0.9907 0.9893 1.0101
dispcorr: -0.015832900 hartree
energy: -1524.239594401058
dipole: 22.02436 -20.27731 1.74704 -5.63153 5.47714 -0.15438 -6.61728 6.45951 -0.15777
magnitude: 1.76093 au
magnitude: 4.47594 debye
