program: Orca
programVersion: 5.0.4
elementType: S P O O O O N C C C C C C C C C C C H H H H H H H H H H H H H H H H
charge: 0
multiplicity: 1
keywords: wb97x-d3
keywords: def2-TZVPP
keywords: def2/J RIJCOSX
keywords: DEFGRID2
keywords: scfconv7
keywords: smallprint printgap noloewdin
keywords: NOSOSCF
formula: C11H16NO4PS
InChI: InChI=1/C11H16NO4PS/c1-8(2)15-11(13)9-6-4-5-7-10(9)16-17(12,18)14-3/h4-8H,12H2,1-3H3
34 atoms
S  -3.933193 -0.170935 0.347664
P  -2.111164 -0.762389 0.280209
O  2.821436 -0.134936 -0.41956
O  -1.043428 0.085899 1.16744
O  -1.381518 -0.649481 -1.144881
O  1.167977 -1.311204 0.503219
N  -1.88683 -2.31637 0.783141
C  3.63231 -1.308872 -0.5927
C  0.934009 1.063367 0.227468
C  -0.374695 1.177353 0.708435
C  1.617616 -0.256786 0.13516
C  4.575108 -1.003914 -1.739449
C  4.370587 -1.632183 0.69354
C  1.58793 2.232307 -0.169568
C  -1.006731 2.410355 0.773287
C  0.964243 3.463937 -0.101851
C  -0.337328 3.551582 0.369625
C  -2.060243 -1.075709 -2.315948
H  2.986292 -2.147839 -0.862705
H  4.029057 -0.766673 -2.652191
H  5.231193 -0.164996 -1.503335
H  5.203336 -1.871044 -1.942665
H  3.683634 -1.861328 1.506437
H  5.007299 -0.800438 0.998477
H  5.008801 -2.503715 0.544465
H  2.600438 2.175442 -0.540467
H  -2.021309 2.458014 1.145815
H  1.493457 4.353099 -0.416009
H  -0.835286 4.510588 0.423289
H  -2.579916 -2.695619 1.405636
H  -0.939291 -2.612035 0.972785
H  -2.997081 -0.532864 -2.447791
H  -2.271652 -2.146241 -2.283468
H  -1.399971 -0.869257 -3.155022
totalener: -1524.22154490 hartree
nucrepener: 1709.07042591 hartree
electener: -3233.29197081 hartree
oneelecener: -5491.60059263 hartree
twoeener: 2258.30862181 hartree
kineticenergy: 1519.46055199 hartree
xcener: -110.327264246305 hartree
chargesum: -0.0000000
charge: -0.397596 0.624795 -0.275367 -0.324937 -0.299738 -0.418108 -0.323949 0.132435 -0.019813 0.168911 0.510356 -0.230379 -0.257288 -0.182358 -0.125096 -0.117021 -0.111183 -0.121388 0.061950 0.093201 0.081652 0.082207 0.103286 0.083587 0.083298 0.128551 0.129821 0.126375 0.130889 0.161406 0.175288 0.111768 0.106814 0.107630
qa: -0.3976 0.6248 -0.2754 -0.3249 -0.2997 -0.4181 -0.3239 0.1324 -0.0198 0.1689 0.5104 -0.2304 -0.2573 -0.1824 -0.1251 -0.1170 -0.1112 -0.1214 0.0619 0.0932 0.0817 0.0822 0.1033 0.0836 0.0833 0.1286 0.1298 0.1264 0.1309 0.1614 0.1753 0.1118 0.1068 0.1076
va: 2.0788 5.5039 2.1336 2.1175 2.0656 2.0719 3.1218 3.8511 3.6419 4.0053 4.0748 3.9251 3.9138 4.0483 4.0288 3.9350 3.9741 3.8779 1.0245 1.0108 1.0086 1.0084 1.0167 1.0089 1.0087 1.0276 1.0183 1.0021 0.9982 1.0312 1.0325 1.0046 0.9931 0.9912
dispcorr: -0.016162256 hartree
energy: -1524.237707153679
dipole: 23.01196 -21.36211 1.64985 -4.70510 4.49472 -0.21037 -8.48996 7.86482 -0.62514
magnitude: 1.77681 au
magnitude: 4.51630 debye
