program: Orca
programVersion: 5.0.4
elementType: S P O O O O N C C C C C C C C C C C H H H H H H H H H H H H H H H H
charge: 0
multiplicity: 1
keywords: wb97x-d3
keywords: def2-TZVPP
keywords: def2/J RIJCOSX
keywords: DEFGRID2
keywords: scfconv7
keywords: smallprint printgap noloewdin
keywords: NOSOSCF
formula: C11H16NO4PS
InChI: InChI=1/C11H16NO4PS/c1-8(2)15-11(13)9-6-4-5-7-10(9)16-17(12,18)14-3/h4-8H,12H2,1-3H3
34 atoms
S  -3.846302 -0.131861 -0.14746
P  -2.069039 -0.698515 0.285494
O  2.612009 -0.235017 -0.335944
O  -1.16637 0.312815 1.183053
O  -1.062298 -0.881025 -0.952783
O  1.208569 -1.015381 1.217915
N  -1.996601 -2.110522 1.135962
C  3.381103 -1.449652 -0.32504
C  0.890105 1.181786 0.321093
C  -0.45228 1.351701 0.667915
C  1.557523 -0.140279 0.469957
C  4.04569 -1.542303 -1.683986
C  4.383106 -1.427928 0.814115
C  1.591347 2.286217 -0.161247
C  -1.078513 2.578658 0.516517
C  0.978394 3.519622 -0.29225
C  -0.359844 3.662854 0.042191
C  -1.488615 -1.57026 -2.117446
H  2.700702 -2.294567 -0.193329
H  3.309042 -1.547913 -2.486978
H  4.729662 -0.709595 -1.85286
H  4.620443 -2.46582 -1.752065
H  4.980195 -2.340247 0.79933
H  3.889418 -1.373004 1.782984
H  5.065305 -0.581654 0.720692
H  2.631321 2.17857 -0.434228
H  -2.124543 2.670122 0.776401
H  1.543423 4.365781 -0.65845
H  -0.849516 4.621192 -0.068363
H  -2.813256 -2.359094 1.668704
H  -1.119732 -2.341157 1.582702
H  -1.688151 -2.621649 -1.902705
H  -0.677909 -1.50155 -2.838946
H  -2.387202 -1.115904 -2.537104
totalener: -1524.22104201 hartree
nucrepener: 1719.82647340 hartree
electener: -3244.04751541 hartree
oneelecener: -5513.01369020 hartree
twoeener: 2268.96617479 hartree
kineticenergy: 1519.46775431 hartree
xcener: -110.326779655496 hartree
chargesum: 0.0000000
charge: -0.391710 0.616694 -0.276741 -0.325236 -0.302114 -0.397762 -0.320785 0.135300 -0.001079 0.181832 0.470954 -0.226677 -0.254543 -0.182434 -0.122305 -0.121733 -0.109983 -0.119867 0.061917 0.091619 0.081993 0.079454 0.083447 0.103977 0.082047 0.121687 0.128539 0.126311 0.129589 0.162767 0.170178 0.107362 0.104391 0.112911
qa: -0.3917 0.6167 -0.2767 -0.3252 -0.3021 -0.3978 -0.3208 0.1353 -0.0011 0.1818 0.4710 -0.2267 -0.2545 -0.1824 -0.1223 -0.1217 -0.1100 -0.1199 0.0619 0.0916 0.0820 0.0795 0.0834 0.1040 0.0820 0.1217 0.1285 0.1263 0.1296 0.1628 0.1702 0.1074 0.1044 0.1129
va: 2.0857 5.5153 2.1261 2.1207 2.0633 2.0966 3.1193 3.8515 3.6154 3.9729 4.1024 3.9302 3.9159 4.0608 4.0324 3.9443 3.9708 3.8780 1.0247 1.0107 1.0089 1.0081 1.0090 1.0164 1.0088 1.0302 1.0170 1.0018 0.9986 1.0307 1.0321 0.9930 0.9912 1.0059
dispcorr: -0.016549863 hartree
energy: -1524.237591867929
dipole: 22.74600 -21.23286 1.51314 -6.83338 6.45922 -0.37416 -7.62365 7.16447 -0.45918
magnitude: 1.62494 au
magnitude: 4.13027 debye
