program: Orca
programVersion: 5.0.4
elementType: S P O O O O O N C C C C C C C C C H H H H H H H H H H H H
charge: 0
multiplicity: 1
keywords: wb97x-d3
keywords: def2-TZVPP
keywords: def2/J RIJCOSX
keywords: DEFGRID2
keywords: scfconv7
keywords: smallprint printgap noloewdin
keywords: NOSOSCF
formula: C9H12NO5PS
InChI: InChI=1/C9H12NO5PS/c1-7-6-8(4-5-9(7)10(11)12)15-16(17,13-2)14-3/h4-6H,1-3H3
29 atoms
S  -2.310362 -1.124065 1.398605
P  -2.379644 0.038278 -0.122174
O  -1.117229 -0.034658 -1.137601
O  -3.571808 -0.169316 -1.152111
O  -2.441517 1.60439 0.151815
O  4.774507 1.426111 0.034162
O  4.573192 -0.152596 1.454847
N  4.138213 0.545738 0.568374
C  2.201473 -0.940298 0.128089
C  0.177567 0.101608 -0.691799
C  2.770863 0.336598 0.129741
C  0.881196 -1.025358 -0.305723
C  0.760889 1.358235 -0.682267
C  2.076821 1.466753 -0.282938
C  2.902504 -2.204199 0.526346
C  -3.971089 -1.480586 -1.574886
C  -3.189518 2.139768 1.252486
H  0.402209 -1.994542 -0.352163
H  0.208743 2.233017 -0.996154
H  2.54955 2.438466 -0.273293
H  2.339333 -3.06113 0.162756
H  3.910453 -2.273917 0.120933
H  2.974177 -2.294266 1.609941
H  -3.15224 -2.001859 -2.070043
H  -4.78401 -1.341097 -2.281733
H  -4.322986 -2.071012 -0.729846
H  -2.831846 1.736849 2.1988
H  -4.252845 1.929593 1.143207
H  -3.032716 3.214438 1.235234
elementType: S P O N C H
totalener: -1520.71112721 hartree
nucrepener: 1539.68536201 hartree
electener: -3060.39648922 hartree
oneelecener: -5150.02614724 hartree
twoeener: 2089.62965802 hartree
cpcmener: -0.02646883 hartree
kineticenergy: 1516.12055045 hartree
xcener: -108.017021867633 hartree
chargesum: 0.0000000
charge: -0.446503 0.772753 -0.352176 -0.339122 -0.344399 -0.396424 -0.385324 0.545066 -0.049572 0.253514 0.067914 -0.125766 -0.156145 -0.123291 -0.216368 -0.114077 -0.115599 0.134643 0.159181 0.157392 0.098502 0.116672 0.111552 0.128740 0.132232 0.112572 0.114324 0.129970 0.129740
qa: -0.4465 0.7728 -0.3522 -0.3391 -0.3444 -0.3964 -0.3853 0.5451 -0.0496 0.2535 0.0679 -0.1258 -0.1561 -0.1233 -0.2164 -0.1141 -0.1156 0.1346 0.1592 0.1574 0.0985 0.1167 0.1116 0.1287 0.1322 0.1126 0.1143 0.1300 0.1297
va: 1.9933 5.4874 2.1037 2.1026 2.1107 1.8556 1.8552 4.0718 3.9148 3.7622 3.7041 3.9811 4.0529 4.0319 3.8955 3.8350 3.8399 1.0161 1.0039 1.0108 1.0036 0.9959 0.9987 0.9853 0.9906 0.9990 0.9989 0.9856 0.9909
dispcorr: -0.012756457 hartree
energy: -1520.723883667387
dipole: -6.78637 4.35538 -2.43099 -3.57046 3.45314 -0.11731 -0.92116 -0.04902 -0.97018
magnitude: 2.62006 au
magnitude: 6.65966 debye
