program: Orca
programVersion: 5.0.4
elementType: S P O O O O O N C C C C C C C C C H H H H H H H H H H H H
charge: 0
multiplicity: 1
keywords: wb97x-d3
keywords: def2-TZVPP
keywords: def2/J RIJCOSX
keywords: DEFGRID2
keywords: scfconv7
keywords: smallprint printgap noloewdin
keywords: NOSOSCF
formula: C9H12NO5PS
InChI: InChI=1/C9H12NO5PS/c1-7-6-8(4-5-9(7)10(11)12)15-16(17,13-2)14-3/h4-6H,1-3H3
29 atoms
S  -2.436606 -1.496969 1.146621
P  -2.352473 -0.10146 -0.163352
O  -1.085413 -0.130378 -1.174946
O  -3.541217 -0.020738 -1.213585
O  -2.249072 1.392649 0.368922
O  4.534573 1.786582 0.56115
O  4.943386 -0.305103 0.500781
N  4.190997 0.636262 0.39602
C  2.185179 -0.827868 0.351004
C  0.208775 0.044025 -0.741136
C  2.808475 0.384009 0.034735
C  0.862279 -0.968426 -0.061116
C  0.84095 1.240725 -1.036713
C  2.151791 1.405136 -0.642832
C  2.805212 -1.959323 1.115345
C  -4.114822 -1.194324 -1.805547
C  -3.060899 1.84839 1.461206
H  0.341138 -1.89055 0.156948
H  0.324228 2.024011 -1.573647
H  2.660374 2.329255 -0.876106
H  3.507355 -2.523194 0.50218
H  3.337613 -1.622186 2.003213
H  2.025464 -2.64606 1.438788
H  -3.420374 -1.648802 -2.510082
H  -5.005663 -0.871363 -2.33532
H  -4.392592 -1.922686 -1.04532
H  -2.940685 1.206129 2.332483
H  -4.111126 1.883666 1.174421
H  -2.720387 2.850663 1.703014
elementType: S P O N C H
totalener: -1520.70969890 hartree
nucrepener: 1538.45800393 hartree
electener: -3059.16770283 hartree
oneelecener: -5147.57673570 hartree
twoeener: 2088.40903286 hartree
cpcmener: -0.02527225 hartree
kineticenergy: 1516.12686753 hartree
xcener: -108.019793833941 hartree
chargesum: 0.0000000
charge: -0.444978 0.765014 -0.350721 -0.340779 -0.335089 -0.401681 -0.387461 0.549054 -0.056265 0.255122 0.055373 -0.107764 -0.176872 -0.105166 -0.215484 -0.110810 -0.112772 0.140196 0.155959 0.158204 0.111459 0.116916 0.096783 0.130368 0.131845 0.109590 0.111396 0.129045 0.129519
qa: -0.4450 0.7650 -0.3507 -0.3408 -0.3351 -0.4017 -0.3875 0.5491 -0.0563 0.2551 0.0554 -0.1078 -0.1769 -0.1052 -0.2155 -0.1108 -0.1128 0.1402 0.1560 0.1582 0.1115 0.1169 0.0968 0.1304 0.1318 0.1096 0.1114 0.1290 0.1295
va: 1.9975 5.4899 2.1117 2.1049 2.1132 1.8523 1.8519 4.0739 3.9486 3.7605 3.7191 3.9640 4.0584 4.0001 3.8970 3.8285 3.8377 1.0150 1.0023 1.0126 0.9990 0.9966 1.0023 0.9855 0.9894 1.0025 1.0008 0.9859 0.9900
dispcorr: -0.012513412 hartree
energy: -1520.722212313333
dipole: -7.33657 4.77187 -2.56470 -2.40905 2.46445 0.05540 0.74877 -1.51678 -0.76801
magnitude: 2.67780 au
magnitude: 6.80642 debye
