program: Orca
programVersion: 5.0.4
elementType: S P O O O O O N C C C C C C C C C H H H H H H H H H H H H
charge: 0
multiplicity: 1
keywords: wb97x-d3
keywords: def2-TZVPP
keywords: def2/J RIJCOSX
keywords: DEFGRID2
keywords: scfconv7
keywords: smallprint printgap noloewdin
keywords: NOSOSCF
formula: C9H12NO5PS
InChI: InChI=1/C9H12NO5PS/c1-7-6-8(4-5-9(7)10(11)12)15-16(17,13-2)14-3/h4-6H,1-3H3
29 atoms
S  -4.008024 0.143093 1.184444
P  -2.373481 -0.109084 0.226899
O  -1.089875 -0.089103 1.2160
O  -2.140643 -1.492141 -0.52259
O  -2.037354 0.932578 -0.932111
O  4.439124 1.536544 -1.041566
O  4.957772 -0.426344 -0.390986
N  4.15698 0.465884 -0.550994
C  2.217502 -1.01767 -0.091944
C  0.202037 0.029778 0.744552
C  2.788131 0.259478 -0.114677
C  0.897621 -1.097812 0.346441
C  0.788829 1.284135 0.722091
C  2.089637 1.394556 0.279256
C  2.891283 -2.282592 -0.531999
C  -3.13642 -2.031649 -1.402527
C  -2.358016 2.324197 -0.812571
H  0.416132 -2.066195 0.378093
H  0.24338 2.158515 1.049765
H  2.560001 2.367003 0.259305
H  3.407176 -2.172272 -1.484577
H  3.62048 -2.625305 0.201413
H  2.147334 -3.067878 -0.647895
H  -4.093145 -2.135355 -0.89087
H  -2.783506 -3.013693 -1.704317
H  -3.259404 -1.404986 -2.285092
H  -1.81898 2.786736 0.01371
H  -3.429084 2.464466 -0.672082
H  -2.051594 2.790955 -1.744479
elementType: S P O N C H
totalener: -1520.71060501 hartree
nucrepener: 1543.32036463 hartree
electener: -3064.03096964 hartree
oneelecener: -5156.79251854 hartree
twoeener: 2092.76154890 hartree
cpcmener: -0.02962485 hartree
kineticenergy: 1516.11587469 hartree
xcener: -108.016260657754 hartree
chargesum: -0.0000000
charge: -0.430509 0.722057 -0.348052 -0.327935 -0.335344 -0.399326 -0.386274 0.547303 -0.064895 0.221400 0.069097 -0.083773 -0.168331 -0.117971 -0.214642 -0.109349 -0.106975 0.138820 0.171087 0.158006 0.117092 0.111797 0.097441 0.107959 0.128110 0.127579 0.123075 0.118654 0.133901
qa: -0.4305 0.7221 -0.3481 -0.3279 -0.3353 -0.3993 -0.3863 0.5473 -0.0649 0.2214 0.0691 -0.0838 -0.1683 -0.1180 -0.2146 -0.1093 -0.1070 0.1388 0.1711 0.1580 0.1171 0.1118 0.0974 0.1080 0.1281 0.1276 0.1231 0.1187 0.1339
va: 2.0279 5.5154 2.1132 2.1027 2.0558 1.8551 1.8524 4.0757 3.9277 3.7926 3.7071 3.9656 4.0091 4.0190 3.8935 3.8401 3.8216 1.0139 0.9881 1.0136 0.9960 0.9986 1.0029 1.0004 0.9892 0.9875 0.9832 1.0045 0.9905
dispcorr: -0.013201143 hartree
energy: -1520.723806154700
dipole: -2.17705 0.97717 -1.19988 -3.47936 3.31366 -0.16570 -7.04889 6.03065 -1.01824
magnitude: 1.58240 au
magnitude: 4.02213 debye
