program: Orca
programVersion: 5.0.4
elementType: S P O O O O O N C C C C C C C C C H H H H H H H H H H H H
charge: 0
multiplicity: 1
keywords: wb97x-d3
keywords: def2-TZVPP
keywords: def2/J RIJCOSX
keywords: DEFGRID2
keywords: scfconv7
keywords: smallprint printgap noloewdin
keywords: NOSOSCF
formula: C9H12NO5PS
InChI: InChI=1/C9H12NO5PS/c1-7-6-8(4-5-9(7)10(11)12)15-16(17,13-2)14-3/h4-6H,1-3H3
29 atoms
S  -2.051518 -1.248712 1.602196
P  -2.407954 -0.055831 0.151487
O  -1.224748 0.04284 -0.969493
O  -3.647731 -0.355207 -0.796548
O  -2.67391 1.43515 0.621778
O  4.650115 1.616769 0.126364
O  4.698914 -0.308427 1.038133
N  4.125406 0.569538 0.434774
C  2.201945 -0.911126 -0.10239
C  0.091978 0.166977 -0.602707
C  2.734853 0.372453 0.070885
C  0.856641 -0.976139 -0.453123
C  0.635642 1.428012 -0.419428
C  1.972744 1.523264 -0.095435
C  2.951938 -2.201605 0.037636
C  -3.804283 -1.62424 -1.446295
C  -3.040625 2.482547 -0.294644
H  0.401721 -1.943506 -0.620064
H  0.03554 2.319812 -0.539717
H  2.410585 2.500199 0.04872
H  2.342861 -3.016593 -0.34843
H  3.893027 -2.201226 -0.510999
H  3.177078 -2.424035 1.079807
H  -3.074871 -1.741605 -2.246834
H  -4.805598 -1.63791 -1.867109
H  -3.701965 -2.444145 -0.735421
H  -2.841129 3.420962 0.21489
H  -4.100507 2.420764 -0.534781
H  -2.454443 2.447814 -1.212299
elementType: S P O N C H
totalener: -1520.71152566 hartree
nucrepener: 1544.89181748 hartree
electener: -3065.60334314 hartree
oneelecener: -5160.17516042 hartree
twoeener: 2094.57181728 hartree
cpcmener: -0.03121794 hartree
kineticenergy: 1516.10983423 hartree
xcener: -108.015643316320 hartree
chargesum: 0.0000000
charge: -0.426845 0.734475 -0.355655 -0.333032 -0.347016 -0.402226 -0.389120 0.550595 -0.038872 0.259146 0.044404 -0.123326 -0.152021 -0.113239 -0.208335 -0.101491 -0.126413 0.132186 0.165496 0.157935 0.096083 0.116817 0.110648 0.127511 0.130595 0.104739 0.132142 0.130644 0.124174
qa: -0.4268 0.7345 -0.3557 -0.3330 -0.3470 -0.4022 -0.3891 0.5506 -0.0389 0.2591 0.0444 -0.1233 -0.1520 -0.1132 -0.2083 -0.1015 -0.1264 0.1322 0.1655 0.1579 0.0961 0.1168 0.1106 0.1275 0.1306 0.1047 0.1321 0.1306 0.1242
va: 2.0253 5.5087 2.0526 2.0925 2.1084 1.8527 1.8496 4.0775 3.9157 3.7743 3.7261 3.9962 4.0442 4.0298 3.8902 3.8289 3.8363 1.0139 0.9894 1.0147 1.0040 0.9962 0.9993 0.9895 0.9888 1.0026 0.9885 0.9932 0.9891
dispcorr: -0.013392746 hartree
energy: -1520.724918406064
dipole: -5.64583 3.29790 -2.34793 -2.25447 2.52115 0.26668 -7.58172 5.21014 -2.37158
magnitude: 3.34787 au
magnitude: 8.50962 debye
