program: Orca
programVersion: 5.0.4
elementType: S P O O O O O N C C C C C C C C C H H H H H H H H H H H H
charge: 0
multiplicity: 1
keywords: wb97x-d3
keywords: def2-TZVPP
keywords: def2/J RIJCOSX
keywords: DEFGRID2
keywords: scfconv7
keywords: smallprint printgap noloewdin
keywords: NOSOSCF
formula: C9H12NO5PS
InChI: InChI=1/C9H12NO5PS/c1-7-6-8(4-5-9(7)10(11)12)15-16(17,13-2)14-3/h4-6H,1-3H3
29 atoms
S  -2.479973 -1.417123 1.508919
P  -2.385142 -0.260736 -0.011497
O  -1.127682 -0.455616 -1.018169
O  -3.598988 -0.465834 -1.012068
O  -2.248439 1.30177 0.278237
O  4.684748 1.533609 -0.36821
O  4.665392 0.182921 1.279101
N  4.135748 0.706343 0.324997
C  2.239011 -0.898451 0.362041
C  0.16544 -0.171156 -0.652908
C  2.767453 0.346804 0.002859
C  0.911708 -1.129657 0.008024
C  0.708189 1.054142 -1.003633
C  2.025282 1.302211 -0.682098
C  2.980316 -2.003245 1.053148
C  -3.719061 0.277443 -2.239519
C  -3.01934 1.938444 1.305274
H  0.464338 -2.087236 0.239375
H  0.121639 1.793838 -1.530201
H  2.462214 2.25283 -0.950466
H  3.954737 -2.19584 0.606634
H  3.137738 -1.785207 2.108397
H  2.399348 -2.920669 0.98964
H  -3.478781 1.330956 -2.101705
H  -4.755694 0.190464 -2.552696
H  -3.074486 -0.148271 -3.006757
H  -4.079756 1.934211 1.054168
H  -2.667418 2.964539 1.364538
H  -2.870059 1.447823 2.267093
elementType: S P O N C H
totalener: -1520.71069157 hartree
nucrepener: 1540.68296785 hartree
electener: -3061.39365942 hartree
oneelecener: -5151.79388835 hartree
twoeener: 2090.40022893 hartree
cpcmener: -0.02945605 hartree
kineticenergy: 1516.11344144 hartree
xcener: -108.016338303335 hartree
chargesum: -0.0000000
charge: -0.429930 0.725690 -0.352345 -0.338596 -0.326838 -0.401636 -0.388860 0.549597 -0.046728 0.276887 0.042650 -0.128084 -0.173717 -0.101518 -0.209143 -0.111669 -0.107454 0.136969 0.157069 0.159881 0.116650 0.111107 0.095651 0.122360 0.130039 0.122100 0.129177 0.127706 0.112982
qa: -0.4299 0.7257 -0.3523 -0.3386 -0.3268 -0.4016 -0.3889 0.5496 -0.0467 0.2769 0.0426 -0.1281 -0.1737 -0.1015 -0.2091 -0.1117 -0.1075 0.1370 0.1571 0.1599 0.1167 0.1111 0.0957 0.1224 0.1300 0.1221 0.1292 0.1277 0.1130
va: 2.0324 5.5193 2.0881 2.1040 2.0656 1.8533 1.8498 4.0785 3.9441 3.7428 3.7361 4.0153 4.0440 3.9940 3.8921 3.8409 3.8299 1.0154 1.0014 1.0123 0.9964 0.9991 1.0042 0.9916 0.9898 0.9909 0.9843 0.9907 1.0035
dispcorr: -0.013082633 hartree
energy: -1520.723774206850
dipole: -5.41353 3.21960 -2.19393 2.86434 -1.65614 1.20820 -2.04146 0.63520 -1.40626
magnitude: 2.87239 au
magnitude: 7.30104 debye
