program: Orca
programVersion: 5.0.4
elementType: S P O O O O O N C C C C C C C C C H H H H H H H H H H H H
charge: 0
multiplicity: 1
keywords: wb97x-d3
keywords: def2-TZVPP
keywords: def2/J RIJCOSX
keywords: DEFGRID2
keywords: scfconv7
keywords: smallprint printgap noloewdin
keywords: NOSOSCF
formula: C9H12NO5PS
InChI: InChI=1/C9H12NO5PS/c1-7-6-8(4-5-9(7)10(11)12)15-16(17,13-2)14-3/h4-6H,1-3H3
29 atoms
S  -2.542737 -1.460977 1.487214
P  -2.406171 -0.307112 -0.032262
O  -1.146202 -0.53728 -1.028279
O  -3.618972 -0.483929 -1.038943
O  -2.227011 1.250896 0.257831
O  4.392804 1.884563 0.281116
O  4.943398 -0.172775 0.347447
N  4.122628 0.705641 0.214671
C  2.2229 -0.887647 0.371326
C  0.144092 -0.225168 -0.67594
C  2.74579 0.337851 -0.056775
C  0.891735 -1.136987 0.046515
C  0.679286 0.983658 -1.089906
C  1.990002 1.26311 -0.767984
C  2.956016 -1.924542 1.168211
C  -3.703022 0.236245 -2.282411
C  -2.977631 1.915554 1.282056
H  0.439385 -2.069442 0.357619
H  0.091233 1.686898 -1.66298
H  2.422738 2.198709 -1.090951
H  2.24585 -2.655715 1.549023
H  3.684777 -2.458929 0.560212
H  3.483558 -1.49987 2.02092
H  -4.721815 0.114603 -2.639209
H  -3.014522 -0.181142 -3.015121
H  -3.498492 1.29778 -2.14862
H  -2.538144 2.902061 1.398584
H  -2.913187 1.377848 2.22757
H  -4.02227 2.016371 0.990216
elementType: S P O N C H
totalener: -1520.71050915 hartree
nucrepener: 1541.09755346 hartree
electener: -3061.80806261 hartree
oneelecener: -5152.59510101 hartree
twoeener: 2090.78703840 hartree
cpcmener: -0.02936015 hartree
kineticenergy: 1516.11643871 hartree
xcener: -108.017042315552 hartree
chargesum: -0.0000000
charge: -0.430923 0.726240 -0.354998 -0.338375 -0.325179 -0.401655 -0.387631 0.549505 -0.053653 0.270561 0.052561 -0.115948 -0.174713 -0.104691 -0.213048 -0.113651 -0.103254 0.136432 0.156352 0.159225 0.095986 0.111351 0.117663 0.130782 0.122143 0.123221 0.126591 0.110661 0.128443
qa: -0.4309 0.7262 -0.3550 -0.3384 -0.3252 -0.4017 -0.3876 0.5495 -0.0537 0.2706 0.0526 -0.1159 -0.1747 -0.1047 -0.2130 -0.1137 -0.1033 0.1364 0.1564 0.1592 0.0960 0.1114 0.1177 0.1308 0.1221 0.1232 0.1266 0.1107 0.1284
va: 2.0312 5.5182 2.0856 2.1059 2.0674 1.8526 1.8517 4.0756 3.9503 3.7490 3.7239 4.0154 4.0366 3.9927 3.8935 3.8411 3.8289 1.0150 1.0008 1.0129 1.0029 0.9991 0.9959 0.9897 0.9913 0.9907 0.9901 1.0053 0.9844
dispcorr: -0.013111781 hartree
energy: -1520.723620935539
dipole: -5.17751 3.05285 -2.12466 3.13154 -1.91245 1.21908 -1.59068 0.24494 -1.34574
magnitude: 2.79488 au
magnitude: 7.10402 debye
