program: Orca
programVersion: 5.0.4
elementType: S P O O O O O N C C C C C C C C C H H H H H H H H H H H H
charge: 0
multiplicity: 1
keywords: wb97x-d3
keywords: def2-TZVPP
keywords: def2/J RIJCOSX
keywords: DEFGRID2
keywords: scfconv7
keywords: smallprint printgap noloewdin
keywords: NOSOSCF
formula: C9H12NO5PS
InChI: InChI=1/C9H12NO5PS/c1-7-6-8(4-5-9(7)10(11)12)15-16(17,13-2)14-3/h4-6H,1-3H3
29 atoms
S  -2.489646 -1.591696 0.891119
P  -2.404012 0.158145 0.11533
O  -1.16844 1.095782 0.598379
O  -2.368422 0.21845 -1.476354
O  -3.533154 1.209062 0.486574
O  4.447302 -0.125541 -1.689337
O  4.888629 -0.479598 0.364798
N  4.120554 -0.195958 -0.525327
C  2.133461 -0.465766 0.943298
C  0.131592 0.743698 0.316839
C  2.738269 0.091502 -0.189324
C  0.802897 -0.118894 1.164969
C  0.749111 1.287894 -0.797501
C  2.061073 0.947674 -1.05035
C  2.779043 -1.419265 1.903802
C  -1.8573 -0.828467 -2.310557
C  -4.913935 0.820849 0.491837
H  0.288436 -0.529702 2.023521
H  0.220309 1.968145 -1.450767
H  2.55651 1.36716 -1.913738
H  2.016128 -1.862679 2.540339
H  3.302288 -2.230346 1.399582
H  3.496104 -0.915262 2.550699
H  -2.051497 -1.810836 -1.881364
H  -0.786004 -0.701898 -2.457178
H  -2.367885 -0.747249 -3.266095
H  -5.47464 1.68756 0.829694
H  -5.084247 -0.008456 1.177635
H  -5.247539 0.54414 -0.507667
elementType: S P O N C H
totalener: -1520.70917483 hartree
nucrepener: 1546.69837621 hartree
electener: -3067.40755104 hartree
oneelecener: -5163.70699526 hartree
twoeener: 2096.29944423 hartree
cpcmener: -0.02668285 hartree
kineticenergy: 1516.12311609 hartree
xcener: -108.019483743333 hartree
chargesum: -0.0000000
charge: -0.444681 0.754412 -0.348417 -0.337579 -0.339618 -0.400890 -0.387209 0.548803 -0.053317 0.255017 0.056582 -0.112577 -0.185932 -0.092717 -0.212970 -0.088726 -0.119765 0.133040 0.159702 0.158854 0.096864 0.116264 0.112055 0.108808 0.119015 0.131008 0.131925 0.113516 0.128532
qa: -0.4447 0.7544 -0.3484 -0.3376 -0.3396 -0.4009 -0.3872 0.5488 -0.0533 0.2550 0.0566 -0.1126 -0.1859 -0.0927 -0.2130 -0.0887 -0.1198 0.1330 0.1597 0.1589 0.0969 0.1163 0.1121 0.1088 0.1190 0.1310 0.1319 0.1135 0.1285
va: 1.9970 5.5057 2.1062 2.0840 2.1191 1.8537 1.8515 4.0767 3.9350 3.7386 3.7183 3.9881 4.0131 3.9814 3.8946 3.8171 3.8390 1.0170 1.0000 1.0123 1.0029 0.9964 0.9990 1.0093 0.9821 0.9900 0.9902 0.9993 0.9856
dispcorr: -0.013279879 hartree
energy: -1520.722454707854
dipole: -5.76621 3.58372 -2.18249 -2.77909 3.15019 0.37110 -1.13034 0.51436 -0.61598
magnitude: 2.29792 au
magnitude: 5.84084 debye
