program: Orca
programVersion: 5.0.4
elementType: S P O O O O O N C C C C C C C C C H H H H H H H H H H H H
charge: 0
multiplicity: 1
keywords: wb97x-d3
keywords: def2-TZVPP
keywords: def2/J RIJCOSX
keywords: DEFGRID2
keywords: scfconv7
keywords: smallprint printgap noloewdin
keywords: NOSOSCF
formula: C9H12NO5PS
InChI: InChI=1/C9H12NO5PS/c1-7-6-8(4-5-9(7)10(11)12)15-16(17,13-2)14-3/h4-6H,1-3H3
29 atoms
S  -2.479598 -1.465729 1.470628
P  -2.413547 -0.106991 0.130923
O  -1.103606 0.852569 0.115274
O  -2.401874 -0.582966 -1.390681
O  -3.558965 0.976871 0.288343
O  5.123211 0.46466 -0.262338
O  4.590232 -1.590842 -0.114508
N  4.299871 -0.414409 -0.142034
C  2.493897 1.238712 0.3196
C  0.202957 0.473042 0.053414
C  2.900932 -0.053848 -0.042563
C  1.123764 1.462742 0.364006
C  0.625988 -0.802498 -0.297435
C  1.981195 -1.05388 -0.334376
C  3.395199 2.379616 0.685355
C  -3.246016 -1.65212 -1.839137
C  -3.676073 2.118177 -0.58181
H  0.760807 2.441218 0.651397
H  -0.058677 -1.599169 -0.54877
H  2.313474 -2.042753 -0.61365
H  4.142322 2.098706 1.425809
H  3.92312 2.771589 -0.183149
H  2.800954 3.189562 1.103454
H  -4.298782 -1.409849 -1.696588
H  -3.009339 -2.57809 -1.316455
H  -3.04804 -1.775574 -2.900145
H  -4.692565 2.485428 -0.472879
H  -3.504896 1.853541 -1.624322
H  -2.977153 2.896341 -0.280144
elementType: S P O N C H
totalener: -1520.71077356 hartree
nucrepener: 1529.60824912 hartree
electener: -3050.31902268 hartree
oneelecener: -5129.50993895 hartree
twoeener: 2079.19091627 hartree
cpcmener: -0.03014490 hartree
kineticenergy: 1516.11490526 hartree
xcener: -108.020465026167 hartree
chargesum: -0.0000000
charge: -0.421049 0.714392 -0.303266 -0.331674 -0.341855 -0.395058 -0.410278 0.554962 -0.022373 0.287577 0.002542 -0.146020 -0.152518 -0.112501 -0.200548 -0.108782 -0.111123 0.134742 0.131375 0.158786 0.114568 0.110317 0.094572 0.132578 0.113932 0.131520 0.129625 0.123081 0.122476
qa: -0.4210 0.7144 -0.3033 -0.3317 -0.3419 -0.3951 -0.4103 0.5550 -0.0224 0.2876 0.0025 -0.1460 -0.1525 -0.1125 -0.2005 -0.1088 -0.1111 0.1347 0.1314 0.1588 0.1146 0.1103 0.0946 0.1326 0.1139 0.1315 0.1296 0.1231 0.1225
va: 2.0243 5.5237 2.1591 2.0494 2.1185 1.8411 1.8453 4.0833 3.9286 3.7922 3.7848 3.9606 3.9840 4.0635 3.8870 3.8191 3.8372 1.0111 1.0246 1.0178 0.9977 0.9992 1.0037 0.9877 1.0018 0.9909 0.9897 0.9924 0.9905
dispcorr: -0.012763409 hartree
energy: -1520.723536969261
dipole: -5.27295 2.73224 -2.54070 7.81905 -6.19901 1.62004 -6.26661 4.50592 -1.76068
magnitude: 3.48994 au
magnitude: 8.87073 debye
