program: Orca
programVersion: 5.0.4
elementType: S P O O O O O N C C C C C C C C C H H H H H H H H H H H H
charge: 0
multiplicity: 1
keywords: wb97x-d3
keywords: def2-TZVPP
keywords: def2/J RIJCOSX
keywords: DEFGRID2
keywords: scfconv7
keywords: smallprint printgap noloewdin
keywords: NOSOSCF
formula: C9H12NO5PS
InChI: InChI=1/C9H12NO5PS/c1-7-6-8(4-5-9(7)10(11)12)15-16(17,13-2)14-3/h4-6H,1-3H3
29 atoms
S  -2.390437 0.381815 1.915197
P  -2.339392 0.117441 0.019026
O  -1.116449 0.828768 -0.775607
O  -2.191859 -1.375413 -0.508879
O  -3.570681 0.658925 -0.826554
O  4.600758 0.066631 1.479742
O  5.007092 -0.373511 -0.567083
N  4.249552 -0.088521 0.331469
C  2.227021 -0.642655 -0.993607
C  0.199789 0.571393 -0.47019
C  2.844215 0.095438 0.021376
C  0.876123 -0.38543 -1.206274
C  0.830209 1.294002 0.529213
C  2.162756 1.038708 0.77981
C  2.8873 -1.698236 -1.828743
C  -2.901573 -2.453948 0.117067
C  -4.22694 1.891935 -0.501592
H  0.350078 -0.939677 -1.972819
H  0.298655 2.047214 1.093118
H  2.671451 1.596311 1.55312
H  2.125919 -2.283416 -2.340337
H  3.53273 -1.261319 -2.589959
H  3.490743 -2.385114 -1.237197
H  -3.976733 -2.345059 -0.021131
H  -2.673417 -2.50634 1.181039
H  -2.566845 -3.366162 -0.368304
H  -5.06513 1.983444 -1.186548
H  -3.556933 2.740129 -0.63801
H  -4.597263 1.879574 0.522683
elementType: S P O N C H
totalener: -1520.71077585 hartree
nucrepener: 1537.03623056 hartree
electener: -3057.74700641 hartree
oneelecener: -5144.71181824 hartree
twoeener: 2086.96481184 hartree
cpcmener: -0.02635773 hartree
kineticenergy: 1516.12378540 hartree
xcener: -108.017968206639 hartree
chargesum: 0.0000000
charge: -0.446979 0.770965 -0.352897 -0.340466 -0.340309 -0.397609 -0.385334 0.545476 -0.057852 0.257257 0.068550 -0.111586 -0.171219 -0.115664 -0.216477 -0.115305 -0.112150 0.137256 0.153322 0.158119 0.098468 0.111787 0.117049 0.129836 0.112989 0.129627 0.131598 0.129703 0.111846
qa: -0.4470 0.7710 -0.3529 -0.3405 -0.3403 -0.3976 -0.3853 0.5455 -0.0579 0.2573 0.0685 -0.1116 -0.1712 -0.1157 -0.2165 -0.1153 -0.1121 0.1373 0.1533 0.1581 0.0985 0.1118 0.1170 0.1298 0.1130 0.1296 0.1316 0.1297 0.1118
va: 1.9951 5.4877 2.1078 2.1130 2.1015 1.8555 1.8541 4.0728 3.9269 3.7595 3.7052 4.0059 4.0288 4.0193 3.8929 3.8397 3.8305 1.0148 1.0076 1.0117 1.0027 0.9985 0.9956 0.9856 0.9998 0.9905 0.9905 0.9850 1.0006
dispcorr: -0.012619224 hartree
energy: -1520.723395069782
dipole: -7.23553 4.69642 -2.53911 -4.77989 4.54121 -0.23868 -5.67391 4.41229 -1.26162
magnitude: 2.84530 au
magnitude: 7.23218 debye
