program: Orca
programVersion: 5.0.4
elementType: S P O O O O O N C C C C C C C C C H H H H H H H H H H H H
charge: 0
multiplicity: 1
keywords: wb97x-d3
keywords: def2-TZVPP
keywords: def2/J RIJCOSX
keywords: DEFGRID2
keywords: scfconv7
keywords: smallprint printgap noloewdin
keywords: NOSOSCF
formula: C9H12NO5PS
InChI: InChI=1/C9H12NO5PS/c1-7-6-8(4-5-9(7)10(11)12)15-16(17,13-2)14-3/h4-6H,1-3H3
29 atoms
S  -2.66596 -1.849943 1.004328
P  -2.464648 -0.170812 0.113606
O  -1.1440 0.706228 0.464415
O  -2.350414 -0.192147 -1.475541
O  -3.593342 0.86811 0.508832
O  4.553364 -1.143151 -1.110639
O  5.079232 0.14092 0.505363
N  4.259794 -0.370403 -0.224182
C  2.449649 1.127774 0.595595
C  0.162105 0.378464 0.265847
C  2.859431 -0.059247 -0.028507
C  1.079495 1.315234 0.719514
C  0.588467 -0.793498 -0.345732
C  1.944643 -0.994189 -0.496019
C  3.351184 2.213204 1.102693
C  -3.081665 -1.130045 -2.276378
C  -3.647927 2.206477 -0.016135
H  0.712173 2.224242 1.17859
H  -0.093746 -1.551051 -0.704024
H  2.282108 -1.903752 -0.971059
H  3.881819 1.90855 2.003693
H  4.095205 2.512993 0.366206
H  2.757369 3.090725 1.350069
H  -2.697959 -1.035431 -3.288985
H  -4.146674 -0.899076 -2.269193
H  -2.926312 -2.149873 -1.924541
H  -3.486275 2.225361 -1.093042
H  -2.91355 2.840065 0.478403
H  -4.645877 2.578552 0.197952
elementType: S P O N C H
totalener: -1520.71053983 hartree
nucrepener: 1529.33046328 hartree
electener: -3050.04100311 hartree
oneelecener: -5128.88137925 hartree
twoeener: 2078.84037614 hartree
cpcmener: -0.03001911 hartree
kineticenergy: 1516.10880848 hartree
xcener: -108.019500948888 hartree
chargesum: -0.0000000
charge: -0.423737 0.716034 -0.302748 -0.331561 -0.341478 -0.407069 -0.393388 0.550186 -0.030766 0.288976 0.016581 -0.140393 -0.147896 -0.124816 -0.205728 -0.105090 -0.113110 0.134938 0.128563 0.158163 0.111049 0.115848 0.094834 0.130930 0.134087 0.111703 0.123375 0.123069 0.129444
qa: -0.4237 0.7160 -0.3027 -0.3316 -0.3415 -0.4071 -0.3934 0.5502 -0.0308 0.2890 0.0166 -0.1404 -0.1479 -0.1248 -0.2057 -0.1051 -0.1131 0.1349 0.1286 0.1582 0.1110 0.1158 0.0948 0.1309 0.1341 0.1117 0.1234 0.1231 0.1294
va: 2.0199 5.5214 2.1661 2.0503 2.1218 1.8478 1.8439 4.0810 3.9301 3.7994 3.7622 3.9534 3.9745 4.0828 3.8879 3.8141 3.8386 1.0108 1.0270 1.0162 0.9991 0.9967 1.0040 0.9900 0.9874 1.0041 0.9918 0.9905 0.9895
dispcorr: -0.012766813 hartree
energy: -1520.723306645921
dipole: -4.39201 2.08082 -2.31119 9.53926 -7.51920 2.02007 -4.69995 3.37759 -1.32235
magnitude: 3.34229 au
magnitude: 8.49542 debye
