program: Orca
programVersion: 5.0.4
elementType: S P O O O O O N C C C C C C C C C H H H H H H H H H H H H
charge: 0
multiplicity: 1
keywords: wb97x-d3
keywords: def2-TZVPP
keywords: def2/J RIJCOSX
keywords: DEFGRID2
keywords: scfconv7
keywords: smallprint printgap noloewdin
keywords: NOSOSCF
formula: C9H12NO5PS
InChI: InChI=1/C9H12NO5PS/c1-7-6-8(4-5-9(7)10(11)12)15-16(17,13-2)14-3/h4-6H,1-3H3
29 atoms
S  -2.356839 -0.972356 1.573782
P  -2.406949 -0.064469 -0.109505
O  -1.091015 0.806392 -0.494531
O  -2.544052 -0.941641 -1.427892
O  -3.533055 1.035933 -0.317755
O  4.621367 -1.574105 -0.319865
O  5.013558 0.239032 0.72825
N  4.26776 -0.509175 0.138021
C  2.481265 1.21534 -0.001253
C  0.208481 0.426982 -0.323611
C  2.879465 -0.127935 -0.019962
C  1.121826 1.456625 -0.159625
C  0.624835 -0.897191 -0.346215
C  1.969766 -1.162522 -0.19899
C  3.38966 2.399493 0.141679
C  -3.491669 -2.016722 -1.503078
C  -3.913852 1.93013 0.737134
H  0.766018 2.478963 -0.164404
H  -0.060925 -1.719694 -0.489432
H  2.300427 -2.19073 -0.21464
H  4.243036 2.351269 -0.533481
H  2.837147 3.308279 -0.086996
H  3.775841 2.493333 1.155693
H  -3.30432 -2.756561 -0.725419
H  -3.357411 -2.47733 -2.47785
H  -4.512911 -1.645865 -1.418044
H  -3.085429 2.580286 1.017604
H  -4.258507 1.37812 1.610838
H  -4.728779 2.534631 0.348327
elementType: S P O N C H
totalener: -1520.71104067 hartree
nucrepener: 1528.97325436 hartree
electener: -3049.68429503 hartree
oneelecener: -5128.47117264 hartree
twoeener: 2078.78687761 hartree
cpcmener: -0.02714794 hartree
kineticenergy: 1516.12328987 hartree
xcener: -108.021045441671 hartree
chargesum: -0.0000000
charge: -0.437923 0.757867 -0.313385 -0.340273 -0.343049 -0.405595 -0.391642 0.549069 -0.043281 0.246426 0.032445 -0.117296 -0.141228 -0.120040 -0.206243 -0.113227 -0.116633 0.135252 0.138269 0.158554 0.116152 0.095764 0.110385 0.112545 0.131456 0.131325 0.129063 0.113115 0.132127
qa: -0.4379 0.7579 -0.3134 -0.3403 -0.3430 -0.4056 -0.3916 0.5491 -0.0433 0.2464 0.0324 -0.1173 -0.1412 -0.1200 -0.2062 -0.1132 -0.1166 0.1353 0.1383 0.1586 0.1162 0.0958 0.1104 0.1125 0.1315 0.1313 0.1291 0.1131 0.1321
va: 1.9949 5.4877 2.1606 2.0892 2.1114 1.8489 1.8456 4.0805 3.9405 3.8209 3.7401 3.9478 3.9572 4.0594 3.8884 3.8311 3.8366 1.0109 1.0207 1.0162 0.9965 1.0037 0.9993 0.9996 0.9902 0.9889 0.9854 0.9992 0.9903
dispcorr: -0.012431900 hartree
energy: -1520.723472569385
dipole: -6.63818 3.86335 -2.77483 6.10003 -4.99227 1.10776 -1.73907 0.98105 -0.75802
magnitude: 3.08243 au
magnitude: 7.83493 debye
