program: Orca
programVersion: 5.0.4
elementType: S P O O O O O N C C C C C C C C C H H H H H H H H H H H H
charge: 0
multiplicity: 1
keywords: wb97x-d3
keywords: def2-TZVPP
keywords: def2/J RIJCOSX
keywords: DEFGRID2
keywords: scfconv7
keywords: smallprint printgap noloewdin
keywords: NOSOSCF
formula: C9H12NO5PS
InChI: InChI=1/C9H12NO5PS/c1-7-6-8(4-5-9(7)10(11)12)15-16(17,13-2)14-3/h4-6H,1-3H3
29 atoms
S  -2.196247 0.254595 2.121946
P  -2.464745 -0.027164 0.252229
O  -1.209646 0.394059 -0.702863
O  -2.799716 -1.531735 -0.115052
O  -3.616725 0.781515 -0.485441
O  4.555235 -1.680096 0.178236
O  4.963374 0.408363 0.282033
N  4.20373 -0.52162 0.132556
C  2.379103 0.960402 -0.67471
C  0.106558 0.137303 -0.454674
C  2.800392 -0.244356 -0.096817
C  1.007914 1.115749 -0.843277
C  0.545776 -1.051338 0.112279
C  1.902057 -1.235511 0.279376
C  3.274257 2.066346 -1.147451
C  -2.981955 -1.983388 -1.469353
C  -3.776324 2.192937 -0.282093
H  0.632964 2.02401 -1.297563
H  -0.13647 -1.837512 0.403616
H  2.252287 -2.158518 0.718118
H  4.09555 1.703419 -1.763643
H  2.696781 2.768935 -1.744412
H  3.706151 2.618214 -0.31356
H  -3.926136 -1.620865 -1.872164
H  -3.001636 -3.068542 -1.429481
H  -2.161028 -1.6672 -2.11172
H  -3.953085 2.415206 0.769756
H  -4.642598 2.493387 -0.864279
H  -2.901789 2.742421 -0.629851
elementType: S P O N C H
totalener: -1520.71180648 hartree
nucrepener: 1535.13453038 hartree
electener: -3055.84633686 hartree
oneelecener: -5140.51543998 hartree
twoeener: 2084.66910312 hartree
cpcmener: -0.03017281 hartree
kineticenergy: 1516.10997291 hartree
xcener: -108.017743333952 hartree
chargesum: -0.0000000
charge: -0.421728 0.726147 -0.321970 -0.342240 -0.336791 -0.404403 -0.391037 0.549568 -0.046934 0.240118 0.038689 -0.118205 -0.135151 -0.116426 -0.208000 -0.114510 -0.111375 0.136120 0.144185 0.158616 0.116426 0.095961 0.110864 0.127969 0.129468 0.124644 0.110160 0.131435 0.128398
qa: -0.4217 0.7261 -0.3220 -0.3422 -0.3368 -0.4044 -0.3910 0.5496 -0.0469 0.2401 0.0387 -0.1182 -0.1352 -0.1164 -0.2080 -0.1145 -0.1114 0.1361 0.1442 0.1586 0.1164 0.0960 0.1109 0.1280 0.1295 0.1246 0.1102 0.1314 0.1284
va: 2.0264 5.5011 2.0873 2.0937 2.0967 1.8500 1.8471 4.0792 3.9397 3.8062 3.7278 3.9658 3.9454 4.0323 3.8888 3.8291 3.8371 1.0084 1.0175 1.0150 0.9966 1.0037 0.9991 0.9932 0.9889 0.9914 0.9991 0.9897 0.9864
dispcorr: -0.013038170 hartree
energy: -1520.724844648184
dipole: -4.49917 2.21633 -2.28283 5.85791 -4.99647 0.86144 -9.77042 7.33164 -2.43878
magnitude: 3.44979 au
magnitude: 8.76866 debye
