program: Gaussian 09
title: 000067039
version: EM64L-G09RevD.01
frameworkgroup: C1[X(C19H18O7)]
method: RPBEPBE
basis: SDD
operation: Freq
keyword: #pfreq=noraman
keyword: PBEPBE/SDD
title: #p freq=noraman PBEPBE/SDD
converged: YES YES NO NO
title: Mulliken charges:
elementType: O O O O O O O C C C C C C C C C C C C C C C C C C C H H H H H H H H H H H H H H H H H H
charge: -0.257993 -0.263355 -0.266231 -0.275068 -0.259865 -0.243950 -0.202489 0.132667 0.161131 0.289525 0.240088 -0.339653 -0.321709 -0.340190 -0.354198 -0.232623 -0.236421 -0.204409 -0.202464 0.184628 0.206432 0.271057 -0.217624 -0.222653 -0.686592 -0.673505 0.275417 0.270075 0.255591 0.265346 0.237421 0.237449 0.236708 0.238942 0.251000 0.221706 0.224846 0.243727 0.219591 0.200096 0.262030 0.214453 0.224107 0.236959
chargesum: 0.00000
title: Mulliken charges with hydrogens summed into heavy atoms:
elementType: O O O O O O O C C C C C C C C C C C C C C C C C C C
charge: -0.257993 -0.263355 -0.266231 -0.275068 -0.259865 -0.243950 -0.202489 0.132667 0.161131 0.289525 0.240088 -0.064237 -0.051633 -0.084599 -0.088852 0.004797 0.001028 0.032300 0.036478 0.184628 0.206432 0.271057 0.255082 0.245920 -0.004875 0.002014
polarizability: 2.77940338e+02 1.02612594e+01 2.53435070e+02 -2.11323712e+01 -4.23504824e+00 1.64760202e+02
1716.lowfreq: -7.6738 -5.4490 -1.5674 -0.0006 -0.0006 0.0004 11.2262 18.5401 31.5329
frequency: 10.8959 18.4789 31.4838 41.3240 49.8663 59.0864 65.2713 82.6776 88.2486 97.5467 102.1981 117.0679 129.0927 132.6350 160.5391 178.1730 188.1565 232.3821 245.0951 251.0065 260.6547 269.4109 288.6679 295.5130 320.3007 343.8689 359.9372 384.2845 403.3426 435.0982 442.4551 473.9016 500.0395 521.7864 537.4486 547.9843 625.8445 640.4192 653.2174 656.4499 671.6799 678.4243 682.7136 743.5419 762.3355 766.5817 777.5268 781.3649 792.2746 801.2080 803.2170 807.6882 819.3608 843.5167 852.2552 886.6102 888.4782 940.3958 967.0093 970.6037 995.6730 999.4087 1015.6847 1017.6088 1031.9561 1037.2492 1043.9432 1067.0506 1102.0762 1113.1888 1115.5996 1118.3824 1126.8811 1135.4064 1141.2520 1169.8623 1172.7292 1173.3443 1203.8622 1239.3336 1244.6513 1249.3298 1260.4652 1269.7007 1275.3595 1357.4170 1358.3899 1382.2366 1382.9089 1397.9719 1400.6395 1429.5817 1434.2689 1462.4342 1463.3600 1466.3353 1471.6976 1472.2794 1474.1943 1485.1305 1486.0006 1575.4131 1578.1554 1605.6989 1609.1183 1615.0046 1625.8154 1663.6015 2995.6044 2996.3588 3009.9048 3021.6708 3070.6591 3084.7503 3093.1276 3097.2596 3108.6460 3120.1267 3140.5290 3142.4368 3154.1332 3158.7819 3166.7392 3174.2363 3177.4750 3182.3351
redmass: 4.4308 5.7617 5.6656 6.8382 5.3828 3.5460 3.3765 3.5473 4.3553 4.3489 4.5697 4.1177 6.1205 2.7565 2.8782 2.9935 6.5861 2.8866 2.0963 2.1145 2.9440 3.1907 4.3244 5.1102 5.0670 8.7977 4.0647 4.2453 5.5669 4.8976 3.8430 4.7265 4.7415 5.4705 4.8214 5.5305 7.0130 6.5788 6.9172 8.0962 8.4055 4.7040 4.9791 3.5960 5.5032 5.0045 1.6347 1.4600 2.3916 1.1391 1.4713 3.8820 4.2086 5.2043 4.9358 1.4714 1.5036 8.9528 1.3830 1.3796 1.3386 1.3449 2.2765 2.4297 3.1035 2.9626 3.1579 4.0469 2.3086 2.2341 2.2069 2.1098 4.6230 1.4672 1.5402 1.1679 1.0895 2.0560 3.5059 2.5234 3.0584 1.1548 1.1304 1.4774 1.7394 1.4212 1.4142 8.8424 9.6075 1.2834 1.2667 2.2836 2.4092 1.0487 1.0404 1.1732 1.9675 1.4842 1.6219 1.0663 1.0780 7.2713 6.9651 10.0781 8.3492 6.9771 9.4549 12.6385 1.0365 1.0358 1.0583 1.0599 1.1065 1.1009 1.0986 1.1001 1.1027 1.1032 1.0860 1.0864 1.0904 1.0914 1.0950 1.0948 1.1006 1.0995
irintensity: 0.3901 1.0282 1.7180 0.7406 0.8973 0.6761 0.5409 1.9444 0.4497 1.6949 1.7367 0.2741 0.2724 3.5864 4.5085 1.3375 0.2640 3.8612 4.6064 0.5517 2.7385 2.8550 8.6494 8.4940 3.9351 4.4628 7.8292 6.9370 3.8444 1.2840 1.2763 1.0540 7.7772 3.2485 2.6555 0.7347 3.8038 3.7260 2.6607 9.7348 16.3048 33.4039 14.4769 26.1376 3.3847 23.9426 62.4925 32.1124 7.1783 6.7678 17.3579 8.9365 21.0684 2.5480 14.4427 1.3560 1.0852 3.9316 4.2013 3.5949 0.3748 1.0667 16.6511 21.4615 78.8378 133.7593 258.4471 100.5451 117.9093 3.9613 197.0573 60.7144 1119.6494 22.5422 62.7223 2.7559 2.8168 25.2589 15.2744 219.9648 258.5323 3.4295 2.8372 24.7178 160.1323 3.6692 3.3408 2.7538 7.4977 26.4155 20.8617 14.2215 48.5802 0.9346 11.9111 10.3228 60.8490 6.4010 22.3132 10.1258 9.9129 29.1625 14.1900 165.5647 104.1765 34.3681 219.1949 185.1102 26.2188 20.9808 16.3412 25.2540 5.3743 14.5445 25.8442 16.7156 39.4881 33.0875 2.4678 2.6505 7.5391 14.1582 9.5493 4.6892 16.4019 11.2763
temp: 298.150 k
press: 1.00000 atm
elementType: 8 8 8 8 8 8 8 6 6 6 6 6 6 6 6 6 6 6 6 6 6 6 6 6 6 6 1 1 1 1 1 1 1 1 1 1 1 1 1 1 1 1 1 1
symmnumber: 1
zpe: 872622.3 jmol-1
zpe.correction: 0.332364 hartree
zpe.thermalcorrener: 0.357521 hartree
zpe.thermalcorrenthalpy: 0.358465 hartree
zpe.thermalcorrgfe: 0.273841 hartree
zpe.sumelectzpe: -1259.504999 hartree
zpe.sumelectthermal: -1259.479843 hartree
zpe.sumelectthermalent: -1259.478898 hartree
zpe.sumelectthermalfe: -1259.563523 hartree
dipole: -2.4941 -1.6893 -0.8583
dipole: 3.1322
quadrupole: -122.9723 -131.3632 -150.4597
quadrupole: -7.2798 -3.7960 2.1613
quadrupole: 11.9594 3.5685 -15.5279 -7.2798 -3.7960 2.1613
hfenergy: -1259.8373632 hartree
pointgroup: C01 [X(C19H18O7)]
dipole: -1.0135332 -0.6816258 -0.163526 debye
polarizability: 276.2007542|4.201536|248.2764241|-27.8358551|-19.8251189|171.6584311 unknown
InChI: InChI=1S/C19H18O7/c1-3-23-17(20)13-9-5-7-11-15(13)25-19(22)26-16-12-8-6-10-14(16)18(21)24-4-2/h5-12H,3-4H2,1-2H3
charge 0 multiplicity 1
44 atoms
O  1.537885 -1.262327 0.782172
O  -0.630461 -1.187667 1.220482
O  1.93919 1.420001 1.168052
O  -2.781427 1.671658 -1.222521
O  3.029968 2.576597 -0.534775
O  -1.217694 1.656326 0.499979
O  0.087759 -0.595057 -0.952133
C  3.24228 0.156339 -0.397748
C  -2.74068 -0.2349 0.209219
C  2.700281 -1.106655 -0.044602
C  -2.017824 -1.255978 0.882896
C  4.401866 0.167692 -1.218316
C  -4.115135 -0.469722 -0.065918
C  3.307127 -2.308688 -0.454928
C  -2.649598 -2.441954 1.307087
C  5.016455 -1.026552 -1.640771
C  -4.755013 -1.653699 0.348692
C  4.473393 -2.271825 -1.248096
C  -4.022121 -2.639117 1.050222
C  2.725826 1.497196 0.035011
C  -2.142501 1.090683 -0.130601
C  0.308959 -0.949969 0.215544
C  1.414334 2.715668 1.711001
C  -2.251617 3.004114 -1.652059
C  0.78244 2.393389 3.059449
C  -3.038363 3.40972 -2.893389
H  4.802352 1.14509 -1.506142
H  -4.669314 0.304233 -0.603679
H  2.853266 -3.256876 -0.15179
H  -2.049112 -3.194509 1.826079
H  5.913471 -0.98798 -2.267018
H  -5.817046 -1.805209 0.131206
H  4.944874 -3.208305 -1.563947
H  -4.509628 -3.56051 1.385196
H  0.67454 3.097469 0.988997
H  2.259745 3.423651 1.781948
H  -2.380255 3.714548 -0.815021
H  -1.170945 2.892604 -1.85156
H  1.524439 1.965911 3.75572
H  0.373362 3.318114 3.507103
H  -0.042075 1.674673 2.926554
H  -2.676419 4.387769 -3.259348
H  -4.115508 3.499733 -2.67053
H  -2.908077 2.667921 -3.699318
