program: Orca
programVersion: 5.0.4
elementType: S P O O O O O N C C C C C C C C C H H H H H H H H H H H H
charge: 0
multiplicity: 1
keywords: wb97x-d3
keywords: def2-TZVPP
keywords: def2/J RIJCOSX
keywords: DEFGRID2
keywords: scfconv7
keywords: smallprint printgap noloewdin
keywords: NOSOSCF
formula: C9H12NO5PS
InChI: InChI=1/C9H12NO5PS/c1-7-6-8(4-5-9(7)10(11)12)15-16(17,13-2)14-3/h4-6H,1-3H3
29 atoms
S  -2.268009 -0.704142 1.781213
P  -2.355167 -0.133641 -0.045271
O  -1.118752 -0.581883 -0.994775
O  -3.576185 -0.653761 -0.91914
O  -2.37876 1.431235 -0.326098
O  4.85475 -0.948172 0.565147
O  4.638169 1.166474 0.728429
N  4.201544 0.067443 0.474436
C  2.17076 0.987221 -0.619119
C  0.190574 -0.405079 -0.611558
C  2.815038 -0.050616 0.063189
C  0.836588 0.77009 -0.952018
C  0.846413 -1.421413 0.063521
C  2.175335 -1.241411 0.386398
C  2.800966 2.280355 -1.041101
C  -4.017144 -2.017001 -0.851417
C  -3.162649 2.323021 0.479389
H  0.302197 1.532132 -1.50418
H  0.336666 -2.338821 0.321799
H  2.701243 -2.024374 0.913548
H  2.94381 2.95191 -0.195469
H  3.769438 2.138414 -1.518516
H  2.150865 2.78269 -1.754171
H  -4.167757 -2.331515 0.181287
H  -3.297384 -2.678907 -1.33259
H  -4.96335 -2.06472 -1.3830
H  -2.960817 2.174804 1.539983
H  -4.225558 2.182958 0.286176
H  -2.872889 3.33081 0.195901
elementType: S P O N C H
totalener: -1520.71107440 hartree
nucrepener: 1538.60399272 hartree
electener: -3059.31506712 hartree
oneelecener: -5147.86035977 hartree
twoeener: 2088.54529265 hartree
cpcmener: -0.02637036 hartree
kineticenergy: 1516.11943195 hartree
xcener: -108.017345193822 hartree
chargesum: -0.0000000
charge: -0.446632 0.770106 -0.352877 -0.339918 -0.340432 -0.399680 -0.386507 0.547586 -0.061299 0.241555 0.060002 -0.099540 -0.165439 -0.109640 -0.212460 -0.108361 -0.111921 0.139021 0.155796 0.158097 0.110938 0.117431 0.097119 0.107209 0.129167 0.131561 0.110470 0.129498 0.129148
qa: -0.4466 0.7701 -0.3529 -0.3399 -0.3404 -0.3997 -0.3865 0.5476 -0.0613 0.2416 0.0600 -0.0995 -0.1654 -0.1096 -0.2125 -0.1084 -0.1119 0.1390 0.1558 0.1581 0.1109 0.1174 0.0971 0.1072 0.1292 0.1316 0.1105 0.1295 0.1291
va: 1.9948 5.4937 2.1037 2.1062 2.1178 1.8541 1.8529 4.0749 3.9369 3.7737 3.7128 3.9948 4.0286 4.0151 3.8927 3.8301 3.8377 1.0144 1.0036 1.0119 0.9990 0.9956 1.0036 1.0027 0.9867 0.9894 1.0014 0.9861 0.9896
dispcorr: -0.012652939 hartree
energy: -1520.723727339038
dipole: -7.32310 4.76760 -2.55550 5.40438 -5.03542 0.36895 -4.23057 2.98813 -1.24244
magnitude: 2.86537 au
magnitude: 7.28320 debye
