program: Orca
programVersion: 5.0.4
elementType: S P O O O O O N C C C C C C C C C H H H H H H H H H H H H
charge: 0
multiplicity: 1
keywords: wb97x-d3
keywords: def2-TZVPP
keywords: def2/J RIJCOSX
keywords: DEFGRID2
keywords: scfconv7
keywords: smallprint printgap noloewdin
keywords: NOSOSCF
formula: C9H12NO5PS
InChI: InChI=1/C9H12NO5PS/c1-7-6-8(4-5-9(7)10(11)12)15-16(17,13-2)14-3/h4-6H,1-3H3
29 atoms
S  -2.520036 0.503648 2.164503
P  -2.380164 0.260218 0.273447
O  -1.159619 1.007681 -0.491488
O  -2.144529 -1.232008 -0.243479
O  -3.62134 0.857555 -0.512957
O  4.626248 -0.192944 1.348778
O  4.905326 -0.44527 -0.749639
N  4.209998 -0.22277 0.213624
C  2.11433 -0.504479 -1.088436
C  0.154052 0.671782 -0.289704
C  2.799079 0.045084 0.001207
C  0.766815 -0.174823 -1.196872
C  0.849823 1.20722 0.78185
C  2.181688 0.87661 0.927262
C  2.70037 -1.43093 -2.111744
C  -2.780289 -2.350522 0.385772
C  -3.714925 0.835212 -1.946235
H  0.18902 -0.580068 -2.017734
H  0.369446 1.876728 1.481702
H  2.740509 1.28792 1.755818
H  3.347543 -0.901519 -2.810423
H  3.285035 -2.234173 -1.664978
H  1.898314 -1.888405 -2.688104
H  -3.8601 -2.322287 0.239263
H  -2.559435 -2.378455 1.452623
H  -2.377259 -3.24204 -0.087795
H  -3.436601 -0.134793 -2.357947
H  -3.089332 1.612073 -2.384135
H  -4.755063 1.035498 -2.190286
elementType: S P O N C H
totalener: -1520.71778115 hartree
nucrepener: 1541.12322565 hartree
electener: -3061.84100680 hartree
oneelecener: -5152.57592833 hartree
twoeener: 2090.73492153 hartree
cpcmener: -0.02504212 hartree
kineticenergy: 1516.11894215 hartree
xcener: -108.016373839111 hartree
chargesum: 0.0000000
charge: -0.422241 0.720935 -0.351011 -0.325887 -0.330125 -0.386718 -0.375499 0.533835 -0.048387 0.260497 0.054947 -0.118659 -0.164980 -0.114029 -0.213196 -0.109399 -0.113858 0.132803 0.154257 0.156496 0.112023 0.115902 0.094922 0.128303 0.114539 0.125485 0.119799 0.120442 0.128803
qa: -0.4222 0.7209 -0.3510 -0.3259 -0.3301 -0.3867 -0.3755 0.5338 -0.0484 0.2605 0.0549 -0.1187 -0.1650 -0.1140 -0.2132 -0.1094 -0.1139 0.1328 0.1543 0.1565 0.1120 0.1159 0.0949 0.1283 0.1145 0.1255 0.1198 0.1204 0.1288
va: 2.0383 5.5227 2.0907 2.0665 2.1137 1.8687 1.8633 4.0965 3.9123 3.7669 3.7222 3.9944 4.0580 4.0325 3.8957 3.8342 3.8476 1.0123 1.0066 1.0144 0.9987 0.9966 1.0031 0.9846 1.0030 0.9912 0.9918 0.9908 0.9899
dispcorr: -0.013058562 hartree
energy: -1520.730839714741
dipole: -5.42940 3.40242 -2.02698 -7.75037 6.82196 -0.92841 -11.06413 8.76778 -2.29635
magnitude: 3.20059 au
magnitude: 8.13526 debye
