program: Orca
programVersion: 5.0.4
elementType: S P O O O O O N C C C C C C C C C H H H H H H H H H H H H
charge: 0
multiplicity: 1
keywords: wb97x-d3
keywords: def2-TZVPP
keywords: def2/J RIJCOSX
keywords: DEFGRID2
keywords: scfconv7
keywords: smallprint printgap noloewdin
keywords: NOSOSCF
formula: C9H12NO5PS
InChI: InChI=1/C9H12NO5PS/c1-7-6-8(4-5-9(7)10(11)12)15-16(17,13-2)14-3/h4-6H,1-3H3
29 atoms
S  -3.997596 -0.07292 1.233325
P  -2.372019 0.120486 0.248497
O  -1.079784 -0.055113 1.206474
O  -2.152241 -0.884542 -0.972355
O  -2.039131 1.518181 -0.432324
O  4.589413 1.388889 -0.811735
O  4.948323 -0.653987 -0.317296
N  4.22098 0.305554 -0.42049
C  2.164265 -1.061971 -0.168097
C  0.213137 0.036613 0.751788
C  2.828013 0.161935 -0.037528
C  0.831934 -1.087151 0.234293
C  0.888559 1.240097 0.871958
C  2.204459 1.297935 0.463545
C  2.757108 -2.319451 -0.729073
C  -2.589175 -2.246348 -0.884587
C  -2.939692 2.096708 -1.385635
H  0.278148 -2.014191 0.154786
H  0.402898 2.112893 1.286437
H  2.74618 2.228958 0.552637
H  1.96171 -3.0280 -0.952681
H  3.312923 -2.147401 -1.649855
H  3.432863 -2.796488 -0.019727
H  -2.254153 -2.73881 -1.793748
H  -3.675759 -2.300949 -0.822484
H  -2.154829 -2.755208 -0.023183
H  -2.547068 3.080496 -1.628355
H  -3.940191 2.204333 -0.965068
H  -2.988627 1.495895 -2.293716
elementType: S P O N C H
totalener: -1520.71838218 hartree
nucrepener: 1542.24293087 hartree
electener: -3062.96131305 hartree
oneelecener: -5154.60917816 hartree
twoeener: 2091.64786511 hartree
cpcmener: -0.02544211 hartree
kineticenergy: 1516.13016185 hartree
xcener: -108.017535831726 hartree
chargesum: -0.0000000
charge: -0.420750 0.711678 -0.340367 -0.332749 -0.322018 -0.385711 -0.374531 0.532958 -0.069906 0.240084 0.070405 -0.102946 -0.158162 -0.113619 -0.219814 -0.119988 -0.109448 0.143481 0.152895 0.154821 0.095220 0.115664 0.112690 0.134126 0.123122 0.123622 0.127079 0.107553 0.124611
qa: -0.4207 0.7117 -0.3404 -0.3327 -0.3220 -0.3857 -0.3745 0.5330 -0.0699 0.2401 0.0704 -0.1029 -0.1582 -0.1136 -0.2198 -0.1200 -0.1094 0.1435 0.1529 0.1548 0.0952 0.1157 0.1127 0.1341 0.1231 0.1236 0.1271 0.1076 0.1246
va: 2.0351 5.5280 2.1222 2.0590 2.1088 1.8688 1.8648 4.0958 3.9422 3.8002 3.7028 3.9737 4.0226 4.0110 3.9018 3.8240 3.8432 0.9928 1.0028 1.0140 1.0028 0.9965 0.9984 0.9903 1.0046 0.9851 0.9893 1.0001 0.9897
dispcorr: -0.013193128 hartree
energy: -1520.731575304242
dipole: -2.64331 1.42908 -1.21424 -6.23266 5.50405 -0.72861 -7.97867 6.81094 -1.16773
magnitude: 1.83544 au
magnitude: 4.66532 debye
