program: Orca
programVersion: 5.0.4
elementType: S P O O O O O N C C C C C C C C C H H H H H H H H H H H H
charge: 0
multiplicity: 1
keywords: wb97x-d3
keywords: def2-TZVPP
keywords: def2/J RIJCOSX
keywords: DEFGRID2
keywords: scfconv7
keywords: smallprint printgap noloewdin
keywords: NOSOSCF
formula: C9H12NO5PS
InChI: InChI=1/C9H12NO5PS/c1-7-6-8(4-5-9(7)10(11)12)15-16(17,13-2)14-3/h4-6H,1-3H3
29 atoms
S  -2.610224 1.566386 1.501903
P  -2.392537 0.111628 0.280297
O  -1.182754 -0.929054 0.568476
O  -3.630049 -0.879572 0.280848
O  -2.054894 0.48334 -1.2333
O  4.805854 0.499817 1.111289
O  4.703408 0.473152 -1.01631
N  4.202585 0.33866 0.075443
C  2.162841 -0.710709 -0.882203
C  0.136831 -0.585751 0.438145
C  2.796583 -0.01464 0.154548
C  0.81008 -0.981998 -0.703761
C  0.782307 0.095873 1.456518
C  2.125955 0.371102 1.309083
C  2.818331 -1.209708 -2.134859
C  -3.680908 -2.060818 -0.535156
C  -2.688464 1.574595 -1.909094
H  0.277235 -1.533906 -1.467548
H  0.254839 0.393478 2.351971
H  2.643152 0.902237 2.095133
H  3.755244 -1.72939 -1.939049
H  2.152655 -1.909385 -2.63695
H  3.029933 -0.399139 -2.831261
H  -4.719797 -2.380339 -0.549595
H  -3.069495 -2.852376 -0.103939
H  -3.359009 -1.86425 -1.55777
H  -3.722093 1.330766 -2.154349
H  -2.130302 1.738419 -2.827364
H  -2.662364 2.482247 -1.306393
elementType: S P O N C H
totalener: -1520.71765724 hartree
nucrepener: 1541.04717725 hartree
electener: -3061.76483448 hartree
oneelecener: -5152.41263398 hartree
twoeener: 2090.64779949 hartree
cpcmener: -0.02511391 hartree
kineticenergy: 1516.13110242 hartree
xcener: -108.019341406423 hartree
chargesum: -0.0000000
charge: -0.422276 0.719183 -0.350806 -0.330904 -0.321848 -0.388817 -0.377198 0.536159 -0.042919 0.264346 0.041807 -0.124029 -0.160382 -0.111503 -0.206124 -0.114092 -0.103763 0.131706 0.154788 0.155467 0.114821 0.094032 0.110659 0.129381 0.120598 0.119996 0.125456 0.124458 0.111804
qa: -0.4223 0.7192 -0.3508 -0.3309 -0.3218 -0.3888 -0.3772 0.5362 -0.0429 0.2643 0.0418 -0.1240 -0.1604 -0.1115 -0.2061 -0.1141 -0.1038 0.1317 0.1548 0.1555 0.1148 0.0940 0.1107 0.1294 0.1206 0.1200 0.1255 0.1245 0.1118
va: 2.0386 5.5271 2.0923 2.1140 2.0715 1.8673 1.8615 4.0998 3.9098 3.7653 3.7399 3.9906 4.0611 4.0434 3.8942 3.8471 3.8338 1.0111 1.0062 1.0154 0.9971 1.0037 0.9994 0.9898 0.9911 0.9911 0.9846 0.9899 1.0056
dispcorr: -0.013036137 hartree
energy: -1520.730693372046
dipole: -4.76822 2.81898 -1.94924 -5.78339 4.28201 -1.50138 -12.67076 10.54880 -2.12196
magnitude: 3.24906 au
magnitude: 8.25845 debye
