program: Orca
programVersion: 5.0.4
elementType: S P O O O O O N C C C C C C C C C H H H H H H H H H H H H
charge: 0
multiplicity: 1
keywords: wb97x-d3
keywords: def2-TZVPP
keywords: def2/J RIJCOSX
keywords: DEFGRID2
keywords: scfconv7
keywords: smallprint printgap noloewdin
keywords: NOSOSCF
formula: C9H12NO5PS
InChI: InChI=1/C9H12NO5PS/c1-7-6-8(4-5-9(7)10(11)12)15-16(17,13-2)14-3/h4-6H,1-3H3
29 atoms
S  -2.547493 -1.905891 0.890835
P  -2.437346 -0.182752 0.075791
O  -1.126924 0.717373 0.40278
O  -2.394276 -0.121279 -1.516963
O  -3.578145 0.802085 0.566986
O  4.603877 -1.086934 -1.103115
O  5.086198 0.105502 0.594276
N  4.2899 -0.358485 -0.188852
C  2.462277 1.084821 0.695484
C  0.180342 0.393641 0.22321
C  2.884909 -0.043762 -0.021142
C  1.089721 1.272481 0.793192
C  0.619483 -0.716665 -0.485821
C  1.978735 -0.918914 -0.606104
C  3.351276 2.10969 1.334435
C  -3.194459 -0.986365 -2.329949
C  -3.680026 2.166545 0.126935
H  0.714115 2.135886 1.327844
H  -0.054787 -1.424293 -0.946339
H  2.324082 -1.781549 -1.157164
H  2.751998 2.961335 1.651533
H  3.855466 1.714884 2.215646
H  4.117856 2.479315 0.654633
H  -2.863536 -0.841327 -3.355407
H  -4.250791 -0.727841 -2.25288
H  -3.053769 -2.030828 -2.050971
H  -3.514354 2.263807 -0.945721
H  -2.972775 2.794517 0.66696
H  -4.692492 2.48901 0.35653
elementType: S P O N C H
totalener: -1520.71779978 hartree
nucrepener: 1529.00532672 hartree
electener: -3049.72312650 hartree
oneelecener: -5128.26577042 hartree
twoeener: 2078.54264392 hartree
cpcmener: -0.02532134 hartree
kineticenergy: 1516.11968103 hartree
xcener: -108.020472544157 hartree
chargesum: 0.0000000
charge: -0.412977 0.706120 -0.300967 -0.327721 -0.333408 -0.394751 -0.382092 0.538849 -0.030783 0.280614 0.007493 -0.139512 -0.144003 -0.119095 -0.200654 -0.107910 -0.114522 0.131540 0.126434 0.157272 0.092060 0.111145 0.113667 0.129265 0.131050 0.112235 0.121477 0.121020 0.128154
qa: -0.4130 0.7061 -0.3010 -0.3277 -0.3334 -0.3948 -0.3821 0.5388 -0.0308 0.2806 0.0075 -0.1395 -0.1440 -0.1191 -0.2007 -0.1079 -0.1145 0.1315 0.1264 0.1573 0.0921 0.1111 0.1137 0.1293 0.1310 0.1122 0.1215 0.1210 0.1282
va: 2.0312 5.5310 2.1652 2.0542 2.1259 1.8624 1.8554 4.1060 3.9372 3.8116 3.7796 3.9552 3.9766 4.0746 3.8916 3.8209 3.8450 1.0118 1.0282 1.0184 1.0039 0.9993 0.9980 0.9897 0.9874 1.0049 0.9919 0.9904 0.9896
dispcorr: -0.012743605 hartree
energy: -1520.730543387658
dipole: -5.04264 2.67190 -2.37074 9.73367 -7.71151 2.02216 -3.86846 2.69247 -1.17599
magnitude: 3.33054 au
magnitude: 8.46555 debye
