program: Orca
programVersion: 5.0.4
elementType: S P O O O O O N C C C C C C C C C H H H H H H H H H H H H
charge: 0
multiplicity: 1
keywords: wb97x-d3
keywords: def2-TZVPP
keywords: def2/J RIJCOSX
keywords: DEFGRID2
keywords: scfconv7
keywords: smallprint printgap noloewdin
keywords: NOSOSCF
formula: C9H12NO5PS
InChI: InChI=1/C9H12NO5PS/c1-7-6-8(4-5-9(7)10(11)12)15-16(17,13-2)14-3/h4-6H,1-3H3
29 atoms
S  -2.289899 -0.710685 1.788694
P  -2.359017 -0.138083 -0.037742
O  -1.11322 -0.582562 -0.976489
O  -3.569188 -0.657972 -0.925338
O  -2.381779 1.426811 -0.317068
O  4.862971 -0.94921 0.550768
O  4.656068 1.167282 0.698583
N  4.21384 0.067663 0.462653
C  2.17421 0.987822 -0.614904
C  0.192046 -0.403812 -0.596016
C  2.821696 -0.048042 0.067048
C  0.838273 0.770742 -0.940364
C  0.851994 -1.4179 0.078897
C  2.181931 -1.236531 0.397385
C  2.804588 2.279075 -1.043303
C  -4.024162 -2.014452 -0.863866
C  -3.170534 2.320052 0.478393
H  0.300617 1.531966 -1.490922
H  0.344179 -2.335752 0.340585
H  2.712138 -2.020375 0.919343
H  2.953284 2.95354 -0.200568
H  3.770734 2.135186 -1.525707
H  2.152442 2.781512 -1.755347
H  -4.170241 -2.337652 0.167501
H  -3.316867 -2.682057 -1.357261
H  -4.976244 -2.048638 -1.387633
H  -2.983139 2.172376 1.542361
H  -4.232771 2.18592 0.273079
H  -2.874032 3.327904 0.199089
elementType: S P O N C H
totalener: -1520.71866994 hartree
nucrepener: 1537.76893368 hartree
electener: -3058.48760362 hartree
oneelecener: -5146.14688465 hartree
twoeener: 2087.65928103 hartree
cpcmener: -0.02247153 hartree
kineticenergy: 1516.12427358 hartree
xcener: -108.017705579954 hartree
chargesum: 0.0000000
charge: -0.440593 0.759224 -0.348522 -0.332672 -0.334033 -0.387014 -0.375497 0.534083 -0.060982 0.236967 0.057060 -0.098038 -0.159733 -0.110555 -0.210351 -0.108800 -0.112772 0.135141 0.151964 0.155354 0.111280 0.115247 0.094709 0.106845 0.127065 0.129454 0.110757 0.127484 0.126928
qa: -0.4406 0.7592 -0.3485 -0.3327 -0.3340 -0.3870 -0.3755 0.5341 -0.0610 0.2370 0.0571 -0.0980 -0.1597 -0.1106 -0.2104 -0.1088 -0.1128 0.1351 0.1520 0.1554 0.1113 0.1152 0.0947 0.1068 0.1271 0.1295 0.1108 0.1275 0.1269
va: 2.0007 5.5058 2.1097 2.1126 2.1228 1.8679 1.8638 4.0967 3.9360 3.7876 3.7207 3.9926 4.0278 4.0195 3.8970 3.8345 3.8423 1.0156 1.0048 1.0138 0.9991 0.9965 1.0036 1.0032 0.9869 0.9894 1.0014 0.9862 0.9896
dispcorr: -0.012627775 hartree
energy: -1520.731297710562
dipole: -7.35460 4.87127 -2.48334 5.42944 -5.05972 0.36972 -4.27999 3.08670 -1.19329
magnitude: 2.77986 au
magnitude: 7.06584 debye
