program: Orca
programVersion: 5.0.4
elementType: S P O O O O O N C C C C C C C C C H H H H H H H H H H H H
charge: 0
multiplicity: 1
keywords: wb97x-d3
keywords: def2-TZVPP
keywords: def2/J RIJCOSX
keywords: DEFGRID2
keywords: scfconv7
keywords: smallprint printgap noloewdin
keywords: NOSOSCF
formula: C9H12NO5PS
InChI: InChI=1/C9H12NO5PS/c1-7-6-8(4-5-9(7)10(11)12)15-16(17,13-2)14-3/h4-6H,1-3H3
29 atoms
S  -4.005641 -0.160033 1.162005
P  -2.367443 0.099936 0.231521
O  -1.067326 -0.08815 1.175369
O  -2.099671 -0.854263 -1.030198
O  -2.062233 1.532041 -0.399123
O  4.583824 1.392485 -0.868042
O  4.962978 -0.656434 -0.391723
N  4.235841 0.302872 -0.483042
C  2.2125 -1.104559 -0.09705
C  0.220173 0.013163 0.719309
C  2.8405 0.14496 -0.086314
C  0.882243 -1.130756 0.310693
C  0.861699 1.240756 0.723274
C  2.175449 1.29874 0.308595
C  2.841216 -2.396499 -0.532889
C  -2.587193 -2.190917 -1.048515
C  -3.031846 2.171892 -1.223133
H  0.355773 -2.076481 0.321823
H  0.344626 2.131353 1.050147
H  2.691889 2.247177 0.295919
H  2.07255 -3.161284 -0.6296
H  3.34794 -2.311814 -1.492332
H  3.577244 -2.747718 0.187842
H  -2.351538 -2.595952 -2.029382
H  -3.665047 -2.219902 -0.88777
H  -2.105742 -2.805338 -0.285193
H  -2.668084 3.178261 -1.41244
H  -3.998615 2.224418 -0.72066
H  -3.145726 1.648554 -2.173152
totalener: -1520.70211669 hartree
nucrepener: 1541.52588771 hartree
electener: -3062.22800440 hartree
oneelecener: -5153.11447485 hartree
twoeener: 2090.88647044 hartree
kineticenergy: 1516.17190157 hartree
xcener: -108.024177928524 hartree
chargesum: 0.0000000
charge: -0.350291 0.670680 -0.319687 -0.318041 -0.306480 -0.335411 -0.331611 0.491990 -0.066199 0.225285 0.014398 -0.083068 -0.116251 -0.090078 -0.202693 -0.123932 -0.123189 0.100837 0.128001 0.144472 0.076690 0.109321 0.115297 0.122450 0.121794 0.103287 0.115522 0.111894 0.115014
qa: -0.3503 0.6707 -0.3197 -0.3180 -0.3065 -0.3354 -0.3316 0.4920 -0.0662 0.2253 0.0144 -0.0831 -0.1163 -0.0901 -0.2027 -0.1239 -0.1232 0.1008 0.1280 0.1445 0.0767 0.1093 0.1153 0.1224 0.1218 0.1033 0.1155 0.1119 0.1150
va: 2.1027 5.5445 2.1470 2.0643 2.1160 1.9121 1.8952 4.1358 3.9772 3.8823 3.8279 4.0026 4.0285 4.0168 3.9282 3.8626 3.8691 1.0087 1.0135 1.0234 1.0035 0.9996 0.9993 0.9894 1.0091 0.9862 0.9912 1.0021 0.9890
dispcorr: -0.013001427 hartree
energy: -1520.715118114978
dipole: -2.81274 1.73679 -1.07595 -5.90360 5.50267 -0.40093 -7.35236 6.55981 -0.79255
magnitude: 1.39519 au
magnitude: 3.54630 debye
