program: Orca
programVersion: 5.0.4
elementType: S P O O O O O N C C C C C C C C C H H H H H H H H H H H H
charge: 0
multiplicity: 1
keywords: wb97x-d3
keywords: def2-TZVPP
keywords: def2/J RIJCOSX
keywords: DEFGRID2
keywords: scfconv7
keywords: smallprint printgap noloewdin
keywords: NOSOSCF
formula: C9H12NO5PS
InChI: InChI=1/C9H12NO5PS/c1-7-6-8(4-5-9(7)10(11)12)15-16(17,13-2)14-3/h4-6H,1-3H3
29 atoms
S  -2.268632 -0.051546 2.162301
P  -2.361553 0.123877 0.271872
O  -1.163958 0.913302 -0.489238
O  -2.349765 -1.235029 -0.583065
O  -3.611828 0.964457 -0.236774
O  4.781445 -1.054298 -0.284266
O  4.821997 0.648561 1.005482
N  4.25641 -0.112797 0.259335
C  2.198289 -0.375684 -1.129669
C  0.158171 0.626302 -0.285452
C  2.835873 0.116388 0.014352
C  0.839555 -0.096327 -1.248412
C  0.806526 1.10162 0.842201
C  2.15521 0.848996 0.978008
C  2.856491 -1.148556 -2.236266
C  -2.980074 -2.416634 -0.099784
C  -3.82896 1.277909 -1.610626
H  0.301697 -0.442609 -2.121205
H  0.268214 1.661555 1.593064
H  2.683157 1.220654 1.843393
H  3.132186 -2.152072 -1.91771
H  2.169444 -1.237367 -3.076058
H  3.763747 -0.668615 -2.598439
H  -2.708042 -2.612548 0.93767
H  -2.635114 -3.235449 -0.726231
H  -4.065836 -2.34146 -0.17451
H  -3.14109 2.052645 -1.948367
H  -4.847558 1.649852 -1.686929
H  -3.724624 0.401241 -2.251457
totalener: -1520.70234853 hartree
nucrepener: 1539.25996314 hartree
electener: -3059.96231167 hartree
oneelecener: -5148.81854294 hartree
twoeener: 2088.85623127 hartree
kineticenergy: 1516.16879687 hartree
xcener: -108.024547428975 hartree
chargesum: 0.0000000
charge: -0.351015 0.695622 -0.347914 -0.325630 -0.298649 -0.333638 -0.335778 0.494131 -0.039940 0.227800 -0.005255 -0.100927 -0.125700 -0.084450 -0.195112 -0.115172 -0.129365 0.103187 0.136083 0.146001 0.113683 0.077183 0.108660 0.116542 0.113838 0.111603 0.114964 0.121424 0.107823
qa: -0.3510 0.6956 -0.3479 -0.3256 -0.2986 -0.3336 -0.3358 0.4941 -0.0399 0.2278 -0.0053 -0.1009 -0.1257 -0.0844 -0.1951 -0.1152 -0.1294 0.1032 0.1361 0.1460 0.1137 0.0772 0.1087 0.1165 0.1138 0.1116 0.1150 0.1214 0.1078
va: 2.1047 5.5200 2.0989 2.0673 2.1314 1.8935 1.9122 4.1379 3.9343 3.8579 3.8471 4.0332 4.0584 4.0387 3.9228 3.8651 3.8840 1.0223 1.0132 1.0234 0.9996 1.0038 1.0002 1.0078 0.9908 0.9862 0.9903 0.9898 0.9929
dispcorr: -0.012745250 hartree
energy: -1520.715093777545
dipole: -6.21378 4.40257 -1.81121 -5.37720 5.04595 -0.33125 -11.77953 10.10474 -1.67479
magnitude: 2.48900 au
magnitude: 6.32653 debye
