program: Orca
programVersion: 5.0.4
elementType: S P O O O O O N C C C C C C C C C H H H H H H H H H H H H
charge: 0
multiplicity: 1
keywords: wb97x-d3
keywords: def2-TZVPP
keywords: def2/J RIJCOSX
keywords: DEFGRID2
keywords: scfconv7
keywords: smallprint printgap noloewdin
keywords: NOSOSCF
formula: C9H12NO5PS
InChI: InChI=1/C9H12NO5PS/c1-7-6-8(4-5-9(7)10(11)12)15-16(17,13-2)14-3/h4-6H,1-3H3
29 atoms
S  -2.342115 -1.499622 1.051725
P  -2.366356 0.012865 -0.116739
O  -1.176359 1.097146 0.062402
O  -2.26308 -0.266103 -1.680443
O  -3.62944 0.97826 -0.030939
O  4.922041 -0.155723 0.711606
O  4.667777 -0.287066 -1.406312
N  4.244918 -0.124299 -0.28722
C  2.142006 -0.10064 1.057688
C  0.145741 0.750977 -0.018976
C  2.818421 0.149658 -0.14061
C  0.785057 0.209782 1.081325
C  0.831373 0.985806 -1.199023
C  2.17412 0.676403 -1.252836
C  2.743761 -0.695824 2.297545
C  -2.935274 -1.365929 -2.286492
C  -4.218838 1.328027 1.216901
H  0.213888 0.020011 1.97997
H  0.32337 1.407462 -2.0548
H  2.726744 0.844708 -2.165167
H  3.409114 0.005757 2.797568
H  1.949799 -0.963797 2.992384
H  3.322143 -1.594761 2.092651
H  -2.788059 -2.282878 -1.71513
H  -2.509242 -1.485284 -3.279096
H  -4.003058 -1.164261 -2.376408
H  -4.353686 0.451126 1.851336
H  -5.188108 1.766611 0.994678
H  -3.607142 2.062471 1.742063
totalener: -1520.70486164 hartree
nucrepener: 1539.43004404 hartree
electener: -3060.13490568 hartree
oneelecener: -5149.24141469 hartree
twoeener: 2089.10650901 hartree
kineticenergy: 1516.17652880 hartree
xcener: -108.026464951510 hartree
chargesum: -0.0000000
charge: -0.389180 0.718983 -0.336452 -0.314530 -0.308577 -0.331708 -0.337713 0.492938 -0.048707 0.228537 -0.000623 -0.086408 -0.139181 -0.081514 -0.199349 -0.120775 -0.120424 0.108147 0.129634 0.144602 0.112592 0.083171 0.108156 0.113393 0.115705 0.115667 0.109315 0.118145 0.116154
qa: -0.3892 0.7190 -0.3365 -0.3145 -0.3086 -0.3317 -0.3377 0.4929 -0.0487 0.2285 -0.0006 -0.0864 -0.1392 -0.0815 -0.1993 -0.1208 -0.1204 0.1081 0.1296 0.1446 0.1126 0.0832 0.1082 0.1134 0.1157 0.1157 0.1093 0.1181 0.1162
va: 2.0518 5.5289 2.1263 2.1348 2.1261 1.8952 1.9101 4.1369 3.9620 3.8590 3.8433 3.9928 4.0646 4.0123 3.9260 3.8650 3.8589 1.0254 1.0135 1.0235 0.9990 1.0036 1.0010 1.0041 0.9908 0.9872 1.0060 0.9905 0.9873
dispcorr: -0.012500010 hartree
energy: -1520.717361647867
dipole: -7.41311 5.42275 -1.99036 -0.62771 1.08916 0.46145 2.70055 -2.77705 -0.07650
magnitude: 2.04459 au
magnitude: 5.19693 debye
