program: Orca
programVersion: 5.0.4
elementType: S P O O O O O N C C C C C C C C C H H H H H H H H H H H H
charge: 0
multiplicity: 1
keywords: wb97x-d3
keywords: def2-TZVPP
keywords: def2/J RIJCOSX
keywords: DEFGRID2
keywords: scfconv7
keywords: smallprint printgap noloewdin
keywords: NOSOSCF
formula: C9H12NO5PS
InChI: InChI=1/C9H12NO5PS/c1-7-6-8(4-5-9(7)10(11)12)15-16(17,13-2)14-3/h4-6H,1-3H3
29 atoms
S  -3.950076 -1.241473 0.067161
P  -2.362073 -0.203136 -0.064526
O  -1.045813 -1.100797 -0.342494
O  -2.337377 0.933305 -1.196879
O  -1.881839 0.625487 1.209534
O  4.55266 1.472874 -0.934949
O  5.022825 0.103877 0.63519
N  4.251161 0.618103 -0.137616
C  2.311297 -0.49937 0.975609
C  0.236682 -0.625136 -0.276166
C  2.861323 0.171785 -0.123444
C  0.97676 -0.876872 0.865238
C  0.799756 0.039152 -1.352731
C  2.11564 0.442669 -1.263314
C  3.024751 -0.821113 2.25674
C  -3.024365 0.762949 -2.431259
C  -2.795934 1.470601 1.900624
H  0.502248 -1.391618 1.690246
H  0.229213 0.228888 -2.250409
H  2.570757 0.968278 -2.089347
H  2.309603 -1.198223 2.985585
H  3.79013 -1.580792 2.110851
H  3.516034 0.047672 2.690648
H  -4.063179 0.474324 -2.268604
H  -2.543045 0.006211 -3.053675
H  -2.987573 1.720998 -2.94431
H  -2.305659 1.77778 2.8206
H  -3.717142 0.937887 2.141662
H  -3.034213 2.35545 1.30922
totalener: -1520.70220100 hartree
nucrepener: 1537.39789169 hartree
electener: -3058.10009269 hartree
oneelecener: -5144.93909911 hartree
twoeener: 2086.83900642 hartree
kineticenergy: 1516.17015773 hartree
xcener: -108.024670774904 hartree
chargesum: 0.0000000
charge: -0.353850 0.676567 -0.322865 -0.321312 -0.299545 -0.339179 -0.333640 0.499016 -0.036688 0.224744 -0.015083 -0.091460 -0.112317 -0.097769 -0.191232 -0.122819 -0.126613 0.106711 0.120090 0.146314 0.079250 0.113114 0.108634 0.119836 0.107854 0.120263 0.115596 0.110925 0.115459
qa: -0.3539 0.6766 -0.3229 -0.3213 -0.2995 -0.3392 -0.3336 0.4990 -0.0367 0.2247 -0.0151 -0.0915 -0.1123 -0.0978 -0.1912 -0.1228 -0.1266 0.1067 0.1201 0.1463 0.0792 0.1131 0.1086 0.1198 0.1079 0.1203 0.1156 0.1109 0.1155
va: 2.1019 5.5396 2.1431 2.0674 2.1148 1.9109 1.8939 4.1393 3.9239 3.8862 3.8633 3.9815 4.0560 4.0440 3.9224 3.8587 3.8708 1.0179 1.0068 1.0260 1.0037 1.0001 1.0002 1.0097 0.9858 0.9888 0.9909 1.0024 0.9890
dispcorr: -0.012763805 hartree
energy: -1520.714964800700
dipole: -3.10661 1.93312 -1.17349 4.31867 -3.71139 0.60728 3.07110 -3.07521 -0.00412
magnitude: 1.32132 au
magnitude: 3.35853 debye
