program: Orca
programVersion: 5.0.4
elementType: S P O O O O O N C C C C C C C C C H H H H H H H H H H H H
charge: 0
multiplicity: 1
keywords: wb97x-d3
keywords: def2-TZVPP
keywords: def2/J RIJCOSX
keywords: DEFGRID2
keywords: scfconv7
keywords: smallprint printgap noloewdin
keywords: NOSOSCF
formula: C9H12NO5PS
InChI: InChI=1/C9H12NO5PS/c1-7-6-8(4-5-9(7)10(11)12)15-16(17,13-2)14-3/h4-6H,1-3H3
29 atoms
S  -3.952975 0.376729 1.35309
P  -2.418659 -0.04751 0.314458
O  -1.062765 0.557596 0.949774
O  -2.012605 -1.577176 0.135674
O  -2.42947 0.443804 -1.211222
O  4.784982 -0.755554 -0.956503
O  5.080498 0.789379 0.487972
N  4.374974 0.058487 -0.164328
C  2.018194 -0.32228 -0.902584
C  0.24173 0.393408 0.589835
C  2.934557 0.159796 0.036826
C  0.665014 -0.178299 -0.600889
C  1.172008 0.869788 1.504545
C  2.513428 0.759956 1.217375
C  2.368415 -0.964581 -2.214605
C  -2.984088 -2.541279 -0.2583
C  -2.940922 1.720156 -1.581305
H  -0.050106 -0.526869 -1.330748
H  0.839888 1.321244 2.42891
H  3.242462 1.135165 1.91989
H  3.075797 -0.374692 -2.794065
H  2.814429 -1.947093 -2.07277
H  1.466959 -1.087278 -2.812388
H  -3.896134 -2.443018 0.331947
H  -2.545195 -3.519626 -0.082866
H  -3.2258 -2.439414 -1.316735
H  -2.227898 2.509651 -1.34026
H  -3.887448 1.926524 -1.08066
H  -3.097235 1.698474 -2.656844
totalener: -1520.70245704 hartree
nucrepener: 1534.11410571 hartree
electener: -3054.81656276 hartree
oneelecener: -5138.27998135 hartree
twoeener: 2083.46341859 hartree
kineticenergy: 1516.16116919 hartree
xcener: -108.026731793037 hartree
chargesum: -0.0000000
charge: -0.343398 0.649781 -0.274680 -0.306136 -0.314051 -0.335838 -0.340420 0.497650 -0.056893 0.213084 -0.038947 -0.048069 -0.168885 -0.061078 -0.193226 -0.121773 -0.112394 0.089133 0.135098 0.147545 0.108364 0.112688 0.074709 0.112568 0.119936 0.113628 0.113005 0.114148 0.114450
qa: -0.3434 0.6498 -0.2747 -0.3061 -0.3141 -0.3358 -0.3404 0.4976 -0.0569 0.2131 -0.0389 -0.0481 -0.1689 -0.0611 -0.1932 -0.1218 -0.1124 0.0891 0.1351 0.1475 0.1084 0.1127 0.0747 0.1126 0.1199 0.1136 0.1130 0.1141 0.1144
va: 2.1246 5.5408 2.1967 2.1013 2.0571 1.8926 1.9085 4.1396 3.9967 3.9625 3.8793 3.8172 4.0290 4.0070 3.9292 3.8585 3.8572 1.0450 1.0119 1.0224 1.0008 1.0000 1.0059 1.0061 0.9902 0.9888 0.9871 1.0105 0.9904
dispcorr: -0.012618706 hartree
energy: -1520.715075750811
dipole: -4.42923 3.01496 -1.41427 -3.40641 3.15871 -0.24770 -10.61421 9.57234 -1.04188
magnitude: 1.77398 au
magnitude: 4.50911 debye
