program: Orca
programVersion: 5.0.4
elementType: S P O O O O O N C C C C C C C C C H H H H H H H H H H H H
charge: 0
multiplicity: 1
keywords: wb97x-d3
keywords: def2-TZVPP
keywords: def2/J RIJCOSX
keywords: DEFGRID2
keywords: scfconv7
keywords: smallprint printgap noloewdin
keywords: NOSOSCF
formula: C9H12NO5PS
InChI: InChI=1/C9H12NO5PS/c1-7-6-8(4-5-9(7)10(11)12)15-16(17,13-2)14-3/h4-6H,1-3H3
29 atoms
S  -2.545426 -1.075265 1.530002
P  -2.444913 -0.045346 -0.073848
O  -1.106368 0.837495 -0.310401
O  -2.505603 -0.827078 -1.459498
O  -3.547583 1.084704 -0.276666
O  4.564251 -1.655652 -0.253083
O  5.05675 0.254082 0.567885
N  4.272615 -0.541695 0.109403
C  2.490364 1.202852 -0.035083
C  0.187634 0.436093 -0.195845
C  2.875035 -0.142665 -0.002121
C  1.127843 1.454172 -0.138276
C  0.591343 -0.891165 -0.164271
C  1.940564 -1.165657 -0.07519
C  3.419601 2.381648 0.005847
C  -3.370219 -1.944862 -1.640028
C  -3.983202 1.901191 0.805937
H  0.783094 2.479112 -0.181142
H  -0.113851 -1.70797 -0.202303
H  2.269078 -2.194154 -0.057663
H  4.227387 2.300049 -0.719021
H  2.863923 3.291013 -0.215871
H  3.879963 2.496704 0.985116
H  -3.28916 -2.646513 -0.808802
H  -3.060458 -2.434132 -2.559705
H  -4.407303 -1.622779 -1.737363
H  -3.233488 2.654942 1.048958
H  -4.193418 1.303529 1.693724
H  -4.893704 2.395886 0.478264
totalener: -1520.70437056 hartree
nucrepener: 1527.33045273 hartree
electener: -3048.03482329 hartree
oneelecener: -5124.88246332 hartree
twoeener: 2076.84764004 hartree
kineticenergy: 1516.16761586 hartree
xcener: -108.027864755022 hartree
chargesum: -0.0000000
charge: -0.373318 0.690877 -0.296170 -0.307986 -0.312938 -0.339223 -0.335654 0.494915 -0.041882 0.241175 -0.018817 -0.107975 -0.093343 -0.104839 -0.192655 -0.123779 -0.124014 0.106053 0.099902 0.145099 0.108587 0.076914 0.113562 0.110705 0.120959 0.119284 0.114286 0.111584 0.118688
qa: -0.3733 0.6909 -0.2962 -0.3080 -0.3129 -0.3392 -0.3357 0.4949 -0.0419 0.2412 -0.0188 -0.1080 -0.0933 -0.1048 -0.1927 -0.1238 -0.1240 0.1061 0.0999 0.1451 0.1086 0.0769 0.1136 0.1107 0.1210 0.1193 0.1143 0.1116 0.1187
va: 2.0589 5.5460 2.1951 2.1026 2.1358 1.9099 1.8911 4.1403 3.9727 3.9118 3.8651 3.9595 3.9547 4.0849 3.9224 3.8524 3.8637 1.0197 1.0427 1.0260 1.0004 1.0042 0.9996 1.0058 0.9894 0.9905 0.9879 1.0045 0.9900
dispcorr: -0.012235705 hartree
energy: -1520.716606263776
dipole: -6.13486 4.09998 -2.03488 6.10909 -5.30876 0.80033 -2.17645 1.64235 -0.53410
magnitude: 2.25089 au
magnitude: 5.72131 debye
