program: Orca
programVersion: 5.0.4
elementType: Cl Cl P O O O O C C C C H H H H H H H
charge: 0
multiplicity: 1
keywords: wb97x-d3
keywords: def2-TZVPP
keywords: def2/J RIJCOSX
keywords: DEFGRID2
keywords: scfconv7
keywords: smallprint printgap noloewdin
keywords: NOSOSCF
formula: C4H7Cl2O4P
InChI: InChI=1/C4H7Cl2O4P/c1-8-11(7,9-2)10-3-4(5)6/h3H,1-2H3
18 atoms
Cl -3.609012 -0.004907 0.552907
Cl -2.096336 -0.443813 -1.893182
P  1.644228 0.128436 0.547319
O  2.676971 -0.650956 -0.361075
O  1.766915 1.615424 0.022836
O  0.234942 -0.304841 -0.127385
O  1.717028 -0.094195 2.003006
C  3.01613 -2.023119 -0.107293
C  2.840367 2.465742 0.456886
C  -0.954205 -0.121245 0.49776
C  -2.079185 -0.173475 -0.202736
H  3.184627 -2.205534 0.953576
H  3.93475 -2.223658 -0.652558
H  2.229294 -2.682787 -0.472034
H  3.784279 2.152504 0.011148
H  2.931108 2.469644 1.542823
H  2.59899 3.468889 0.116004
H  -0.963411 0.042847 1.569168
elementType: Cl P O C H
totalener: -1719.46912347 hartree
nucrepener: 977.58670656 hartree
electener: -2697.05583003 hartree
oneelecener: -4314.92432465 hartree
twoeener: 1617.86849462 hartree
cpcmener: -0.01853687 hartree
kineticenergy: 1715.45270079 hartree
xcener: -100.212225433315 hartree
chargesum: -0.0000000
charge: -0.046010 -0.045842 0.953698 -0.340855 -0.340330 -0.317946 -0.608758 -0.107160 -0.111310 0.097152 -0.018602 0.115867 0.127585 0.125919 0.124385 0.118284 0.127981 0.145941
qa: -0.0460 -0.0458 0.9537 -0.3409 -0.3403 -0.3179 -0.6088 -0.1072 -0.1113 0.0972 -0.0186 0.1159 0.1276 0.1259 0.1244 0.1183 0.1280 0.1459
va: 1.2537 1.2692 5.6090 2.1147 2.1146 2.1594 1.9946 3.8280 3.8359 3.8791 4.1458 0.9965 0.9890 0.9890 0.9891 0.9936 0.9881 1.0128
dispcorr: -0.006044489 hartree
energy: -1719.475167960424
dipole: 22.85092 -21.46878 1.38214 1.45568 -1.36890 0.08678 4.14393 -4.40078 -0.25685
magnitude: 1.40848 au
magnitude: 3.58006 debye
