program: Orca
programVersion: 5.0.4
elementType: Cl Cl P O O O O C C C C H H H H H H H
charge: 0
multiplicity: 1
keywords: wb97x-d3
keywords: def2-TZVPP
keywords: def2/J RIJCOSX
keywords: DEFGRID2
keywords: scfconv7
keywords: smallprint printgap noloewdin
keywords: NOSOSCF
formula: C4H7Cl2O4P
InChI: InChI=1/C4H7Cl2O4P/c1-8-11(7,9-2)10-3-4(5)6/h3H,1-2H3
18 atoms
Cl -3.212206 -0.372734 -1.286868
Cl -1.924022 -1.585207 1.017631
P  1.513305 0.668907 0.472905
O  1.740613 -0.663282 -0.377228
O  1.607478 1.782705 -0.660154
O  -0.071218 0.706414 0.7952
O  2.320374 0.818319 1.683594
C  1.975692 -1.900726 0.292747
C  2.877822 2.162266 -1.181525
C  -1.027355 0.632012 -0.163215
C  -1.938243 -0.332278 -0.144477
H  2.302603 -2.610995 -0.462112
H  1.060925 -2.271993 0.755656
H  2.748867 -1.802093 1.054313
H  2.716137 3.039197 -1.802859
H  3.303368 1.36647 -1.793884
H  3.574866 2.415823 -0.382427
H  -1.056171 1.412901 -0.913528
totalener: -1719.45514179 hartree
nucrepener: 1001.14864764 hartree
electener: -2720.60378943 hartree
oneelecener: -4361.51603256 hartree
twoeener: 1640.91224314 hartree
kineticenergy: 1715.50662560 hartree
xcener: -100.217719740160 hartree
chargesum: -0.0000000
charge: -0.033943 -0.032194 0.871963 -0.327562 -0.327096 -0.304407 -0.496448 -0.114499 -0.128534 0.032161 0.036765 0.113650 0.100773 0.123685 0.115101 0.114863 0.122207 0.133514
qa: -0.0339 -0.0322 0.8720 -0.3276 -0.3271 -0.3044 -0.4964 -0.1145 -0.1285 0.0322 0.0368 0.1136 0.1008 0.1237 0.1151 0.1149 0.1222 0.1335
va: 1.2674 1.2848 5.6387 2.0694 2.1003 2.1720 2.1416 3.8609 3.8674 3.9690 4.1106 0.9900 0.9983 0.9984 0.9904 0.9896 0.9921 1.0176
dispcorr: -0.007052150 hartree
energy: -1719.462193940337
dipole: 19.48288 -19.04302 0.43986 3.49657 -3.64196 -0.14539 -3.50652 2.29067 -1.21584
magnitude: 1.30111 au
magnitude: 3.30717 debye
