program: Orca
programVersion: 5.0.2
elementType: S S P O O O O N C C C C C C C C H H H H H H H H H H H H H H H H H H
charge: 0
multiplicity: 1
keywords: wb97x-d3
keywords: def2-TZVPP
keywords: def2/J RIJCOSX
keywords: DEFGRID2
keywords: scfconv7
keywords: smallprint printgap noloewdin
keywords: NOSOSCF
formula: C8H18NO4PS2
InChI: InChI=1/C8H18NO4PS2/c1-7(8(10)9-2)15-5-6-16-14(11,12-3)13-4/h7,9H,5-6H2,1-4H3
34 atoms
S  2.528596 -0.94119 -1.484245
S  -1.879137 -1.132359 -1.118422
P  -2.015238 -0.131177 0.701756
O  -2.875242 -1.022378 1.693073
O  -3.000234 1.08426 0.405904
O  3.933228 1.670625 -0.02364
O  -0.701885 0.201814 1.306465
N  1.784468 1.729043 0.69371
C  2.784852 -0.417346 0.251755
C  0.767931 -0.56915 -1.70671
C  -0.114305 -1.63632 -1.089151
C  4.048388 -1.084895 0.766321
C  2.891972 1.097553 0.293384
C  1.627718 3.163706 0.723019
C  -4.185126 -1.511377 1.387538
C  -2.581672 2.179049 -0.420267
H  1.932951 -0.76357 0.839883
H  0.598543 -0.512943 -2.782422
H  0.552671 0.418989 -1.302291
H  0.168894 -1.878147 -0.067255
H  -0.069981 -2.559394 -1.665752
H  4.261861 -0.755145 1.783644
H  3.922931 -2.166162 0.785676
H  4.916091 -0.854128 0.149338
H  0.95902 1.176996 0.899107
H  1.351749 3.500844 1.721645
H  0.849922 3.482491 0.028804
H  2.555708 3.652506 0.442791
H  -4.916313 -0.704663 1.403983
H  -4.210272 -2.00913 0.416908
H  -4.434107 -2.236772 2.157195
H  -2.44544 1.857775 -1.453143
H  -3.372693 2.922607 -0.378411
H  -1.65486 2.619645 -0.051626
elementType: S P O N C H
totalener: -1809.33478269 hartree
nucrepener: 1681.16647361 hartree
electener: -3490.50125630 hartree
oneelecener: -5834.52698531 hartree
twoeener: 2344.02572901 hartree
cpcmener: -0.04480999 hartree
kineticenergy: 1804.20645488 hartree
xcener: -118.499728467028 hartree
chargesum: -0.0000000
charge: -0.174053 -0.206651 0.855675 -0.350226 -0.342899 -0.588217 -0.623522 -0.226530 0.030133 -0.129969 -0.087295 -0.279075 0.311738 -0.153777 -0.106543 -0.105034 0.092795 0.138631 0.101678 0.121060 0.138924 0.109123 0.104952 0.091799 0.222452 0.116625 0.109112 0.102543 0.124471 0.109656 0.128869 0.113675 0.133838 0.116041
qa: -0.1741 -0.2067 0.8557 -0.3502 -0.3429 -0.5882 -0.6235 -0.2265 0.0301 -0.1300 -0.0873 -0.2791 0.3117 -0.1538 -0.1065 -0.1050 0.0928 0.1386 0.1017 0.1211 0.1389 0.1091 0.1050 0.0918 0.2225 0.1166 0.1091 0.1025 0.1245 0.1097 0.1289 0.1137 0.1338 0.1160
va: 2.1872 2.2589 5.4607 2.1240 2.0875 1.9308 1.9617 3.1870 3.8324 3.9402 3.8130 3.9217 4.1580 3.8727 3.8428 3.8493 1.0339 1.0112 1.0384 1.0283 1.0113 1.0009 1.0103 1.0187 1.0172 0.9908 0.9883 1.0266 0.9908 0.9955 0.9891 0.9953 0.9916 0.9851
dispcorr: -0.017052823 hartree
energy: -1809.351835512374
dipole: 2.38087 -6.45486 -4.07399 4.83413 -5.34802 -0.51389 1.82926 -2.11814 -0.28888
magnitude: 4.11642 au
magnitude: 10.46310 debye
