program: Orca
programVersion: 5.0.2
elementType: S S P O O O O N C C C C C C C C H H H H H H H H H H H H H H H H H H
charge: 0
multiplicity: 1
keywords: wb97x-d3
keywords: def2-TZVPP
keywords: def2/J RIJCOSX
keywords: DEFGRID2
keywords: scfconv7
keywords: smallprint printgap noloewdin
keywords: NOSOSCF
formula: C8H18NO4PS2
InChI: InChI=1/C8H18NO4PS2/c1-7(8(10)9-2)15-5-6-16-14(11,12-3)13-4/h7,9H,5-6H2,1-4H3
34 atoms
S  2.587076 -0.570213 -1.989414
S  -1.682398 -1.338476 -0.985738
P  -1.99908 0.232979 0.321323
O  -2.086021 -0.479425 1.742752
O  -3.525175 0.60505 0.039146
O  3.589582 -0.843894 1.170081
O  -1.037048 1.360069 0.226748
N  1.800019 0.506778 1.339651
C  3.144537 0.593079 -0.690785
C  0.775996 -0.453078 -1.948119
C  0.150275 -1.442585 -0.985247
C  2.703664 2.026061 -0.929754
C  2.864636 0.019472 0.691253
C  1.383054 -0.004485 2.623182
C  -2.388366 0.291381 2.917017
C  -3.865081 1.484915 -1.039247
H  4.230402 0.546184 -0.805748
H  0.446041 -0.66829 -2.965572
H  0.473268 0.570001 -1.73352
H  0.510968 -1.332888 0.034544
H  0.36363 -2.466722 -1.291024
H  3.120466 2.682811 -0.164249
H  3.068778 2.36979 -1.896452
H  1.621825 2.159152 -0.925149
H  1.160186 1.123437 0.862818
H  2.209565 -0.002207 3.332785
H  0.990976 -1.021971 2.560222
H  0.603656 0.642161 3.017229
H  -1.873652 1.252338 2.920211
H  -3.462728 0.457675 2.994429
H  -2.055292 -0.290538 3.772469
H  -3.492945 1.110348 -1.994316
H  -4.950552 1.526812 -1.078299
H  -3.474008 2.487401 -0.867314
elementType: S P O N C H
totalener: -1809.33712857 hartree
nucrepener: 1707.24059675 hartree
electener: -3516.57772532 hartree
oneelecener: -5886.75814967 hartree
twoeener: 2370.18042435 hartree
cpcmener: -0.03508629 hartree
kineticenergy: 1804.19564508 hartree
xcener: -118.491127546084 hartree
chargesum: -0.0000000
charge: -0.167109 -0.179115 0.853181 -0.347645 -0.362604 -0.530825 -0.616737 -0.228730 0.082328 -0.164784 -0.077007 -0.311948 0.270047 -0.184685 -0.140543 -0.107982 0.110327 0.129916 0.116282 0.108033 0.137869 0.117069 0.101881 0.089142 0.214753 0.119534 0.111340 0.111687 0.119304 0.136592 0.133302 0.108711 0.127816 0.120601
qa: -0.1671 -0.1791 0.8532 -0.3476 -0.3626 -0.5308 -0.6167 -0.2287 0.0823 -0.1648 -0.0770 -0.3119 0.2700 -0.1847 -0.1405 -0.1080 0.1103 0.1299 0.1163 0.1080 0.1379 0.1171 0.1019 0.0891 0.2148 0.1195 0.1113 0.1117 0.1193 0.1366 0.1333 0.1087 0.1278 0.1206
va: 2.1793 2.2835 5.4717 2.0749 2.0958 1.9890 1.9560 3.1248 3.7971 3.9767 3.8373 3.9487 4.2035 3.9089 3.8427 3.8505 1.0247 1.0125 1.0250 1.0352 1.0124 1.0020 1.0116 1.0073 0.9972 1.0042 0.9881 0.9946 0.9908 0.9951 0.9840 0.9950 0.9907 0.9958
dispcorr: -0.018960236 hartree
energy: -1809.356088807217
dipole: 1.23975 -3.90192 -2.66217 10.04686 -8.37442 1.67243 5.39898 -5.27716 0.12182
magnitude: 3.14627 au
magnitude: 7.99718 debye
