program: Orca
programVersion: 5.0.2
elementType: S S P O O O O N C C C C C C C C H H H H H H H H H H H H H H H H H H
charge: 0
multiplicity: 1
keywords: wb97x-d3
keywords: def2-TZVPP
keywords: def2/J RIJCOSX
keywords: DEFGRID2
keywords: scfconv7
keywords: smallprint printgap noloewdin
keywords: NOSOSCF
formula: C8H18NO4PS2
InChI: InChI=1/C8H18NO4PS2/c1-7(8(10)9-2)15-5-6-16-14(11,12-3)13-4/h7,9H,5-6H2,1-4H3
34 atoms
S  1.153621 -1.478877 0.192124
S  -1.544301 -0.38273 -1.732604
P  -1.970093 0.129052 0.237287
O  -2.030672 -1.260043 1.009119
O  -3.533038 0.466776 0.1418
O  3.96678 1.126968 0.089079
O  -1.134378 1.199545 0.82733
N  1.859653 1.484569 0.796723
C  2.733126 -0.796418 0.803091
C  1.185841 -0.996557 -1.559994
C  0.204734 0.106877 -1.911216
C  3.924727 -1.615774 0.3402
C  2.911898 0.69858 0.512994
C  1.918249 2.912025 0.605113
C  -1.767229 -1.311167 2.408007
C  -3.943369 1.724769 -0.380254
H  2.631078 -0.902313 1.888997
H  0.975008 -1.887686 -2.15111
H  2.197424 -0.67488 -1.818612
H  0.303704 0.357712 -2.969203
H  0.387551 1.014853 -1.34135
H  3.792371 -2.657924 0.624852
H  4.050797 -1.573125 -0.741316
H  4.846436 -1.246197 0.786634
H  0.963016 1.084053 1.035256
H  0.922027 3.315511 0.765298
H  2.243676 3.171922 -0.402844
H  2.605451 3.386677 1.306877
H  -2.451442 -0.678543 2.975085
H  -1.910183 -2.345119 2.710317
H  -0.740925 -1.014599 2.62305
H  -3.59969 1.859728 -1.408128
H  -5.030392 1.731614 -0.369378
H  -3.572371 2.548352 0.230224
totalener: -1809.31119078 hartree
nucrepener: 1732.39053512 hartree
electener: -3541.70172590 hartree
oneelecener: -5937.37226183 hartree
twoeener: 2395.67053593 hartree
kineticenergy: 1804.28338762 hartree
xcener: -118.504096070343 hartree
chargesum: -0.0000000
charge: -0.140494 -0.163092 0.805000 -0.308995 -0.333152 -0.398923 -0.551979 -0.262621 0.029049 -0.147990 -0.108207 -0.262155 0.247653 -0.158716 -0.109840 -0.125893 0.088906 0.123402 0.102636 0.121267 0.101332 0.093976 0.082740 0.102844 0.190091 0.108505 0.098999 0.110290 0.115516 0.121628 0.095537 0.096491 0.117523 0.118674
qa: -0.1405 -0.1631 0.8050 -0.3090 -0.3332 -0.3989 -0.5520 -0.2626 0.0290 -0.1480 -0.1082 -0.2622 0.2477 -0.1587 -0.1098 -0.1259 0.0889 0.1234 0.1026 0.1213 0.1013 0.0940 0.0827 0.1028 0.1901 0.1085 0.0990 0.1103 0.1155 0.1216 0.0955 0.0965 0.1175 0.1187
va: 2.2107 2.2753 5.5107 2.0857 2.1230 2.1247 2.0162 3.1373 3.8770 3.9754 3.9059 3.9855 4.2553 3.9042 3.8701 3.8839 1.0119 1.0109 1.0224 1.0068 1.0464 1.0105 1.0106 1.0122 1.0459 1.0032 0.9968 0.9971 0.9939 0.9889 0.9978 0.9999 0.9911 0.9930
dispcorr: -0.017673552 hartree
energy: -1809.328864329177
dipole: 9.62308 -10.81133 -1.18825 4.90573 -4.92757 -0.02184 2.50107 -2.46165 0.03941
magnitude: 1.18911 au
magnitude: 3.02246 debye
