program: Orca
programVersion: 5.0.2
elementType: S S P O O O O N C C C C C C C C H H H H H H H H H H H H H H H H H H
charge: 0
multiplicity: 1
keywords: wb97x-d3
keywords: def2-TZVPP
keywords: def2/J RIJCOSX
keywords: DEFGRID2
keywords: scfconv7
keywords: smallprint printgap noloewdin
keywords: NOSOSCF
formula: C8H18NO4PS2
InChI: InChI=1/C8H18NO4PS2/c1-7(8(10)9-2)15-5-6-16-14(11,12-3)13-4/h7,9H,5-6H2,1-4H3
34 atoms
S  1.39534 -1.545259 0.220067
S  -1.509036 -0.711503 -1.275151
P  -2.01642 0.387776 0.43059
O  -2.828335 -0.69767 1.275944
O  -3.176508 1.387393 0.006073
O  4.006526 1.230434 -0.138436
O  -0.905786 1.086295 1.099762
N  1.967769 1.448842 0.790854
C  2.981383 -0.76952 0.690268
C  1.229467 -1.027523 -1.513894
C  0.116978 -0.018058 -1.738177
C  4.174808 -1.506526 0.109705
C  3.032637 0.735153 0.393658
C  1.908173 2.877619 0.61122
C  -2.141635 -1.785315 1.892468
C  -4.352768 0.969398 -0.672031
H  2.986929 -0.884555 1.779765
H  1.054589 -1.920517 -2.114391
H  2.175856 -0.600344 -1.853628
H  0.049971 0.235051 -2.797067
H  0.295702 0.899607 -1.183727
H  4.198994 -1.444768 -0.977785
H  5.108092 -1.083114 0.477474
H  4.134971 -2.557668 0.389215
H  1.130306 0.98881 1.119805
H  0.90659 3.208246 0.87153
H  2.115004 3.165598 -0.420122
H  2.625146 3.395943 1.249399
H  -1.652854 -2.416004 1.148501
H  -1.392217 -1.428269 2.598449
H  -2.889579 -2.368554 2.423473
H  -4.112746 0.461757 -1.608761
H  -4.958959 0.309451 -0.050949
H  -4.922736 1.867445 -0.896121
totalener: -1809.31181315 hartree
nucrepener: 1716.90020131 hartree
electener: -3526.21201446 hartree
oneelecener: -5906.32530179 hartree
twoeener: 2380.11328733 hartree
kineticenergy: 1804.28327215 hartree
xcener: -118.506226771458 hartree
chargesum: -0.0000000
charge: -0.158212 -0.209514 0.829870 -0.327610 -0.310219 -0.401076 -0.539873 -0.264941 0.041849 -0.156816 -0.084397 -0.260530 0.241139 -0.157907 -0.125432 -0.127912 0.090522 0.123946 0.105362 0.120983 0.093352 0.081263 0.102169 0.092353 0.197788 0.111298 0.096899 0.108817 0.106239 0.120242 0.121306 0.102988 0.117058 0.118996
qa: -0.1582 -0.2095 0.8299 -0.3276 -0.3102 -0.4011 -0.5399 -0.2649 0.0418 -0.1568 -0.0844 -0.2605 0.2411 -0.1579 -0.1254 -0.1279 0.0905 0.1239 0.1054 0.1210 0.0934 0.0813 0.1022 0.0924 0.1978 0.1113 0.0969 0.1088 0.1062 0.1202 0.1213 0.1030 0.1171 0.1190
va: 2.1903 2.2340 5.5015 2.1002 2.1526 2.1222 2.0683 3.1442 3.8782 3.9811 3.8922 3.9856 4.2656 3.9026 3.8740 3.8743 1.0123 1.0088 1.0246 1.0105 1.0517 1.0106 1.0125 1.0111 1.0400 1.0051 0.9965 0.9976 0.9930 0.9925 0.9927 0.9973 0.9908 0.9910
dispcorr: -0.017432450 hartree
energy: -1809.329245601192
dipole: 7.90312 -9.59019 -1.68707 -0.47778 -0.39257 -0.87035 -1.50278 1.14850 -0.35428
magnitude: 1.93112 au
magnitude: 4.90852 debye
