program: Orca
programVersion: 5.0.2
elementType: S S P O O O O N C C C C C C C C H H H H H H H H H H H H H H H H H H
charge: 0
multiplicity: 1
keywords: wb97x-d3
keywords: def2-TZVPP
keywords: def2/J RIJCOSX
keywords: DEFGRID2
keywords: scfconv7
keywords: smallprint printgap noloewdin
keywords: NOSOSCF
formula: C8H18NO4PS2
InChI: InChI=1/C8H18NO4PS2/c1-7(8(10)9-2)15-5-6-16-14(11,12-3)13-4/h7,9H,5-6H2,1-4H3
34 atoms
S  2.505982 -0.835572 -1.57692
S  -1.914387 -1.149105 -1.335967
P  -2.116265 -0.238123 0.512387
O  -3.099688 -1.21367 1.292451
O  -3.069788 1.018702 0.244933
O  3.839948 1.648316 0.180301
O  -0.837813 0.07276 1.194517
N  1.68189 1.569318 0.873192
C  2.755921 -0.487503 0.202511
C  0.748285 -0.444986 -1.765702
C  -0.131728 -1.582729 -1.284907
C  4.050513 -1.16373 0.623295
C  2.8293 1.021425 0.416593
C  1.528459 2.97858 1.116558
C  -3.388799 -0.98297 2.671751
C  -2.543044 2.174156 -0.395094
H  1.918663 -0.920076 0.757099
H  0.582049 -0.259343 -2.827511
H  0.522952 0.484182 -1.242978
H  0.125623 -1.902122 -0.277508
H  -0.030755 -2.451421 -1.934549
H  3.995537 -2.238494 0.456531
H  4.897496 -0.765015 0.068029
H  4.239725 -0.991473 1.683068
H  0.883242 0.976803 1.05913
H  1.204602 3.163921 2.141786
H  0.79413 3.425132 0.441704
H  2.48054 3.477166 0.958642
H  -2.476973 -0.837139 3.251535
H  -4.03941 -0.116911 2.796478
H  -3.902776 -1.868658 3.035844
H  -2.10765 1.925607 -1.365967
H  -3.373565 2.858621 -0.548032
H  -1.786454 2.660416 0.222313
totalener: -1809.31488898 hartree
nucrepener: 1682.54680733 hartree
electener: -3491.86169631 hartree
oneelecener: -5837.17480929 hartree
twoeener: 2345.31311298 hartree
kineticenergy: 1804.28127170 hartree
xcener: -118.502185891396 hartree
chargesum: -0.0000000
charge: -0.112132 -0.155194 0.809940 -0.319774 -0.320499 -0.411759 -0.563296 -0.255331 -0.004042 -0.147877 -0.097145 -0.268088 0.273545 -0.161520 -0.141289 -0.119478 0.067691 0.121566 0.080691 0.109218 0.124839 0.095045 0.113462 0.089925 0.202492 0.104080 0.078071 0.118043 0.119756 0.115451 0.120818 0.099561 0.123921 0.109307
qa: -0.1121 -0.1552 0.8099 -0.3198 -0.3205 -0.4118 -0.5633 -0.2553 -0.0040 -0.1479 -0.0971 -0.2681 0.2735 -0.1615 -0.1413 -0.1195 0.0677 0.1216 0.0807 0.1092 0.1248 0.0950 0.1135 0.0899 0.2025 0.1041 0.0781 0.1180 0.1198 0.1155 0.1208 0.0996 0.1239 0.1093
va: 2.2204 2.2884 5.4868 2.1473 2.1025 2.1261 2.0070 3.1382 3.9033 3.9770 3.8334 3.9266 4.1754 3.8885 3.8818 3.8853 1.0299 1.0142 1.0499 1.0314 1.0165 1.0103 1.0189 1.0043 1.0312 0.9896 0.9892 1.0302 0.9924 0.9896 0.9891 0.9970 0.9942 0.9902
dispcorr: -0.017080460 hartree
energy: -1809.331969435033
dipole: 5.49191 -7.76250 -2.27059 6.50041 -6.62786 -0.12744 7.30750 -6.66121 0.64629
magnitude: 2.36422 au
magnitude: 6.00936 debye
