program: Orca
programVersion: 5.0.2
elementType: S S P O O O O N C C C C C C C C H H H H H H H H H H H H H H H H H H
charge: 0
multiplicity: 1
keywords: wb97x-d3
keywords: def2-TZVPP
keywords: def2/J RIJCOSX
keywords: DEFGRID2
keywords: scfconv7
keywords: smallprint printgap noloewdin
keywords: NOSOSCF
formula: C8H18NO4PS2
InChI: InChI=1/C8H18NO4PS2/c1-7(8(10)9-2)15-5-6-16-14(11,12-3)13-4/h7,9H,5-6H2,1-4H3
34 atoms
S  0.744304 0.845343 -1.469743
S  -1.503283 -1.594207 -0.73699
P  -1.782116 -0.253884 0.848708
O  -3.233958 -0.715308 1.34398
O  -2.104352 1.188137 0.275073
O  4.22768 0.332587 0.15199
O  -0.705343 -0.254017 1.855486
N  2.233402 0.359601 1.203439
C  2.430282 1.36321 -1.01583
C  0.98289 -0.924227 -1.805736
C  0.307259 -1.814104 -0.779758
C  2.386766 2.8612 -0.728285
C  3.045313 0.615113 0.165918
C  2.717736 -0.275959 2.402664
C  -3.379711 -1.918857 2.086932
C  -2.921967 1.425513 -0.860566
H  3.087134 1.183728 -1.868368
H  2.053551 -1.139893 -1.826856
H  0.59464 -1.134548 -2.802407
H  0.710026 -1.660317 0.219082
H  0.456221 -2.863548 -1.040304
H  3.385293 3.214991 -0.473019
H  2.046229 3.415425 -1.602357
H  1.720928 3.09074 0.103303
H  1.245671 0.558146 1.145454
H  3.230638 -1.212236 2.180521
H  1.864649 -0.486783 3.041276
H  3.415654 0.363193 2.945773
H  -2.989659 -2.777535 1.536328
H  -2.871134 -1.850662 3.048665
H  -4.444522 -2.061507 2.253298
H  -2.941285 2.501617 -1.012488
H  -2.506784 0.950585 -1.750544
H  -3.941462 1.070762 -0.702539
totalener: -1809.31216635 hartree
nucrepener: 1730.68720703 hartree
electener: -3539.99937338 hartree
oneelecener: -5933.86468836 hartree
twoeener: 2393.86531498 hartree
kineticenergy: 1804.28723307 hartree
xcener: -118.505162672676 hartree
chargesum: 0.0000000
charge: -0.153306 -0.201702 0.823378 -0.338012 -0.299916 -0.397016 -0.545532 -0.263831 0.022350 -0.139557 -0.106452 -0.293226 0.245889 -0.156629 -0.125979 -0.128978 0.097098 0.107142 0.120254 0.109607 0.118697 0.110047 0.099421 0.099622 0.191924 0.099526 0.110494 0.107915 0.098742 0.122748 0.116263 0.122508 0.100132 0.126379
qa: -0.1533 -0.2017 0.8234 -0.3380 -0.2999 -0.3970 -0.5455 -0.2638 0.0223 -0.1396 -0.1065 -0.2932 0.2459 -0.1566 -0.1260 -0.1290 0.0971 0.1071 0.1203 0.1096 0.1187 0.1100 0.0994 0.0996 0.1919 0.0995 0.1105 0.1079 0.0987 0.1227 0.1163 0.1225 0.1001 0.1264
va: 2.2374 2.2414 5.5114 2.1130 2.1118 2.1328 2.0727 3.1037 3.9444 3.9524 3.8930 3.9309 4.2013 3.9032 3.8791 3.8563 1.0300 1.0201 1.0110 1.0449 1.0093 1.0056 1.0097 1.0083 1.0380 0.9966 1.0047 0.9967 0.9994 0.9921 0.9914 0.9904 0.9971 0.9913
dispcorr: -0.017353689 hartree
energy: -1809.329520037033
dipole: 5.81021 -7.55255 -1.74234 1.39601 -1.94345 -0.54744 1.02397 -1.51241 -0.48845
magnitude: 1.89051 au
magnitude: 4.80530 debye
