program: Orca
programVersion: 5.0.2
elementType: S S P O O O O N C C C C C C C C H H H H H H H H H H H H H H H H H H
charge: 0
multiplicity: 1
keywords: wb97x-d3
keywords: def2-TZVPP
keywords: def2/J RIJCOSX
keywords: DEFGRID2
keywords: scfconv7
keywords: smallprint printgap noloewdin
keywords: NOSOSCF
formula: C8H18NO4PS2
InChI: InChI=1/C8H18NO4PS2/c1-7(8(10)9-2)15-5-6-16-14(11,12-3)13-4/h7,9H,5-6H2,1-4H3
34 atoms
S  2.386811 -1.581198 -0.83339
S  -1.833093 -0.295564 -1.459811
P  -2.068024 0.114342 0.573566
O  -2.406715 -1.247168 1.320339
O  -3.487652 0.84898 0.598117
O  3.969836 1.276265 -0.376943
O  -0.922532 0.814062 1.185936
N  1.912097 1.748695 0.450752
C  2.744877 -0.51933 0.616623
C  0.575166 -1.587467 -0.842667
C  -0.004607 -0.375146 -1.547757
C  3.999268 -1.048949 1.294007
C  2.947867 0.925886 0.173408
C  1.892643 3.138959 0.077308
C  -3.429014 -2.137285 0.891971
C  -3.600941 2.192031 0.134951
H  1.893375 -0.607846 1.297603
H  0.221679 -1.665304 0.186103
H  0.268553 -2.5019 -1.352574
H  0.222026 -0.40914 -2.613358
H  0.40019 0.55544 -1.160246
H  3.850625 -2.075304 1.624589
H  4.85119 -1.0187 0.617129
H  4.247704 -0.439312 2.163791
H  1.083989 1.378697 0.896096
H  1.844164 3.78452 0.955739
H  1.032418 3.360721 -0.556635
H  2.798482 3.374591 -0.473564
H  -3.31836 -2.392824 -0.163919
H  -3.326841 -3.042619 1.485026
H  -4.418553 -1.711409 1.05795
H  -3.351771 2.266056 -0.92537
H  -4.636648 2.489777 0.278151
H  -2.953906 2.860283 0.703384
totalener: -1809.31400993 hartree
nucrepener: 1682.83136762 hartree
electener: -3492.14537755 hartree
oneelecener: -5837.81254641 hartree
twoeener: 2345.66716886 hartree
kineticenergy: 1804.26389742 hartree
xcener: -118.499381670646 hartree
chargesum: 0.0000000
charge: -0.109693 -0.206927 0.824474 -0.312232 -0.332613 -0.409254 -0.553191 -0.248055 0.008268 -0.159702 -0.082044 -0.257963 0.259357 -0.149390 -0.126027 -0.129355 0.060555 0.093516 0.115507 0.124326 0.102949 0.094564 0.112069 0.089154 0.199714 0.102240 0.084968 0.113553 0.101418 0.121062 0.122378 0.104967 0.119529 0.121876
qa: -0.1097 -0.2069 0.8245 -0.3122 -0.3326 -0.4093 -0.5532 -0.2481 0.0083 -0.1597 -0.0820 -0.2580 0.2594 -0.1494 -0.1260 -0.1294 0.0606 0.0935 0.1155 0.1243 0.1029 0.0946 0.1121 0.0892 0.1997 0.1022 0.0850 0.1136 0.1014 0.1211 0.1224 0.1050 0.1195 0.1219
va: 2.2162 2.2605 5.4845 2.1181 2.1108 2.1276 2.0628 3.1540 3.8984 4.0006 3.8344 3.9324 4.2001 3.8870 3.8622 3.8773 1.0351 1.0318 1.0142 1.0148 1.0554 1.0117 1.0168 1.0056 1.0204 0.9928 0.9915 1.0267 1.0016 0.9902 0.9916 0.9960 0.9917 0.9917
dispcorr: -0.016796566 hartree
energy: -1809.330806493490
dipole: 2.62043 -5.29412 -2.67369 3.58453 -3.76628 -0.18176 2.93203 -2.81458 0.11745
magnitude: 2.68244 au
magnitude: 6.81821 debye
