program: Orca
programVersion: 5.0.2
elementType: S S P O O O O N C C C C C C C C H H H H H H H H H H H H H H H H H H
charge: 0
multiplicity: 1
keywords: wb97x-d3
keywords: def2-TZVPP
keywords: def2/J RIJCOSX
keywords: DEFGRID2
keywords: scfconv7
keywords: smallprint printgap noloewdin
keywords: NOSOSCF
formula: C8H18NO4PS2
InChI: InChI=1/C8H18NO4PS2/c1-7(8(10)9-2)15-5-6-16-14(11,12-3)13-4/h7,9H,5-6H2,1-4H3
34 atoms
S  1.212684 -1.473994 0.272314
S  -1.573726 -0.472516 -1.436634
P  -1.891223 0.304646 0.483638
O  -1.932538 -0.884823 1.531241
O  -3.451666 0.663641 0.384563
O  3.791664 1.06121 -0.496249
O  -0.98314 1.397095 0.87427
N  1.987786 1.607663 0.761209
C  2.782689 -0.687123 0.788088
C  1.149938 -1.074306 -1.496706
C  0.144018 0.016942 -1.812078
C  3.985799 -1.530723 0.411468
C  2.905439 0.751257 0.27573
C  1.923182 2.995129 0.378719
C  -2.604114 -2.112797 1.295019
C  -3.872847 1.78345 -0.383996
H  2.687805 -0.654332 1.877974
H  0.897203 -1.988228 -2.034641
H  2.141783 -0.767815 -1.836458
H  0.143065 0.227671 -2.883071
H  0.37093 0.944976 -1.292154
H  3.891199 -2.526408 0.841115
H  4.086457 -1.632893 -0.667814
H  4.906316 -1.079858 0.781767
H  1.171342 1.237038 1.225824
H  0.985639 3.214636 -0.132695
H  2.752063 3.229863 -0.28251
H  1.987052 3.640686 1.255664
H  -2.224162 -2.60372 0.397221
H  -2.40606 -2.749515 2.15336
H  -3.681117 -1.968243 1.199737
H  -4.958577 1.812462 -0.334872
H  -3.470424 2.712691 0.020004
H  -3.568071 1.686214 -1.42812
totalener: -1809.31135815 hartree
nucrepener: 1732.13593602 hartree
electener: -3541.44729417 hartree
oneelecener: -5937.00970532 hartree
twoeener: 2395.56241115 hartree
kineticenergy: 1804.27916270 hartree
xcener: -118.505376444522 hartree
chargesum: -0.0000000
charge: -0.144892 -0.206452 0.823553 -0.300057 -0.336361 -0.405298 -0.548835 -0.245101 0.008507 -0.138137 -0.097728 -0.256626 0.248993 -0.140969 -0.128010 -0.127046 0.096252 0.119639 0.105212 0.118872 0.101721 0.091487 0.084081 0.098034 0.188037 0.091651 0.112757 0.103194 0.100890 0.120470 0.124695 0.116284 0.121560 0.099623
qa: -0.1449 -0.2065 0.8236 -0.3001 -0.3364 -0.4053 -0.5488 -0.2451 0.0085 -0.1381 -0.0977 -0.2566 0.2490 -0.1410 -0.1280 -0.1270 0.0963 0.1196 0.1052 0.1189 0.1017 0.0915 0.0841 0.0980 0.1880 0.0917 0.1128 0.1032 0.1009 0.1205 0.1247 0.1163 0.1216 0.0996
va: 2.2078 2.2382 5.5117 2.1163 2.1064 2.1151 2.0665 3.1807 3.8573 3.9380 3.9089 3.9846 4.2396 3.8706 3.8586 3.8783 1.0148 1.0105 1.0353 1.0095 1.0415 1.0107 1.0132 1.0099 1.0335 0.9983 1.0217 0.9975 0.9992 0.9910 0.9918 0.9919 0.9923 0.9994
dispcorr: -0.017537019 hartree
energy: -1809.328895167207
dipole: 7.07254 -8.58056 -1.50801 1.84638 -2.30246 -0.45608 -2.39476 2.07019 -0.32456
magnitude: 1.60856 au
magnitude: 4.08863 debye
