program: Orca
programVersion: 5.0.2
elementType: Cl Cl Cl P O O O O C C C C H H H H H H H H
charge: 0
multiplicity: 1
keywords: wb97x-d3
keywords: def2-TZVPP
keywords: def2/J RIJCOSX
keywords: DEFGRID2
keywords: scfconv7
keywords: smallprint printgap noloewdin
keywords: NOSOSCF
formula: C4H8Cl3O4P
InChI: InChI=1/C4H8Cl3O4P/c1-10-12(9,11-2)3(8)4(5,6)7/h3,8H,1-2H3
20 atoms
Cl 1.069526 -1.887557 -0.325836
Cl 1.796895 0.720031 -1.309839
Cl 2.669432 -0.121262 1.288836
P  -1.491424 0.15464 -0.206099
O  -2.533355 1.050903 0.602691
O  -1.960754 -1.302909 0.219693
O  0.255364 1.711193 1.148095
O  -1.382494 0.435966 -1.657649
C  0.068391 0.379422 0.779848
C  1.332565 -0.201092 0.127945
C  -2.764356 2.435164 0.310624
C  -2.471099 -2.247194 -0.732401
H  -0.086575 -0.18344 1.705947
H  0.311864 2.288808 0.375645
H  -3.838589 2.581016 0.220807
H  -2.291455 2.748388 -0.619296
H  -2.385519 3.042767 1.129522
H  -2.412562 -3.225457 -0.2625
H  -1.88512 -2.259864 -1.65039
H  -3.51044 -2.02312 -0.970222
elementType: Cl P O C H
totalener: -2180.27212950 hartree
nucrepener: 1346.96759548 hartree
electener: -3527.23972498 hartree
oneelecener: -5689.82370243 hartree
twoeener: 2162.58397745 hartree
cpcmener: -0.02988986 hartree
kineticenergy: 2175.63820022 hartree
xcener: -121.429568598334 hartree
chargesum: 0.0000000
charge: -0.041314 -0.047270 -0.048705 0.836355 -0.364063 -0.359569 -0.372894 -0.631057 0.033888 0.082798 -0.096391 -0.110522 0.146706 0.243285 0.126161 0.111506 0.115035 0.132614 0.111296 0.132141
qa: -0.0413 -0.0473 -0.0487 0.8364 -0.3641 -0.3596 -0.3729 -0.6311 0.0339 0.0828 -0.0964 -0.1105 0.1467 0.2433 0.1262 0.1115 0.1150 0.1326 0.1113 0.1321
va: 1.2638 1.2576 1.2429 5.3657 2.0795 2.0673 2.0579 1.9454 3.9439 4.5246 3.8445 3.8194 1.0213 1.0027 0.9906 0.9980 0.9936 0.9870 0.9989 0.9912
dispcorr: -0.009703582 hartree
energy: -2180.281833082205
dipole: -21.26187 20.30600 -0.95586 4.43797 -4.26938 0.16859 0.66942 -0.14730 0.52211
magnitude: 1.10214 au
magnitude: 2.80141 debye
