program: Orca
programVersion: 5.0.2
elementType: Cl Cl Cl P O O O O C C C C H H H H H H H H
charge: 0
multiplicity: 1
keywords: wb97x-d3
keywords: def2-TZVPP
keywords: def2/J RIJCOSX
keywords: DEFGRID2
keywords: scfconv7
keywords: smallprint printgap noloewdin
keywords: NOSOSCF
formula: C4H8Cl3O4P
InChI: InChI=1/C4H8Cl3O4P/c1-10-12(9,11-2)3(8)4(5,6)7/h3,8H,1-2H3
20 atoms
Cl 2.775296 0.959066 0.567654
Cl 1.8518 -1.489897 -0.597217
Cl 1.067215 1.044426 -1.74328
P  -1.400647 -0.410071 -0.058016
O  -2.098947 0.875842 -0.677258
O  -2.314972 -0.721826 1.212884
O  -0.008295 1.479631 1.254148
O  -1.225533 -1.511943 -1.031242
C  0.183754 0.21593 0.700354
C  1.403911 0.173167 -0.234445
C  -3.087008 1.702105 -0.041093
C  -2.150936 -1.938941 1.953082
H  0.420722 -0.457052 1.530976
H  -0.238923 2.125558 0.573689
H  -2.799232 1.978486 0.971422
H  -4.052432 1.199526 -0.024155
H  -3.165761 2.604177 -0.642417
H  -2.111118 -2.804527 1.293007
H  -3.014428 -2.030162 2.605935
H  -1.246102 -1.903116 2.559535
elementType: Cl P O C H
totalener: -2180.27237327 hartree
nucrepener: 1345.57575996 hartree
electener: -3525.84813323 hartree
oneelecener: -5686.97481386 hartree
twoeener: 2161.12668063 hartree
cpcmener: -0.03633566 hartree
kineticenergy: 2175.61693314 hartree
xcener: -121.426700383104 hartree
chargesum: 0.0000000
charge: -0.047561 -0.034202 -0.050177 0.837765 -0.361200 -0.349115 -0.374097 -0.623562 0.004350 0.080250 -0.110091 -0.113400 0.148303 0.246479 0.119245 0.127605 0.130867 0.117218 0.129178 0.122145
qa: -0.0476 -0.0342 -0.0502 0.8378 -0.3612 -0.3491 -0.3741 -0.6236 0.0043 0.0803 -0.1101 -0.1134 0.1483 0.2465 0.1192 0.1276 0.1309 0.1172 0.1292 0.1221
va: 1.2455 1.2627 1.2577 5.3683 2.0633 2.0702 2.0453 1.9755 3.9396 4.5177 3.8219 3.8461 1.0102 1.0009 0.9956 0.9923 0.9890 0.9983 0.9890 0.9836
dispcorr: -0.009623858 hartree
energy: -2180.281997126518
dipole: -21.76203 20.61046 -1.15158 0.24492 0.75418 0.99910 10.91655 -8.99116 1.92538
magnitude: 2.45590 au
magnitude: 6.24240 debye
