program: Orca
programVersion: 5.0.2
elementType: Cl Cl Cl P O O O O C C C C H H H H H H H H
charge: 0
multiplicity: 1
keywords: wb97x-d3
keywords: def2-TZVPP
keywords: def2/J RIJCOSX
keywords: DEFGRID2
keywords: scfconv7
keywords: smallprint printgap noloewdin
keywords: NOSOSCF
formula: C4H8Cl3O4P
InChI: InChI=1/C4H8Cl3O4P/c1-10-12(9,11-2)3(8)4(5,6)7/h3,8H,1-2H3
20 atoms
Cl 1.381672 1.198258 -1.330051
Cl 2.768094 0.398722 1.059306
Cl 1.724626 -1.602666 -0.708561
P  -1.417948 -0.197654 -0.277567
O  -1.88036 1.287936 -0.595494
O  -2.5133 -0.686411 0.776499
O  -0.006631 1.1271 1.581166
O  -1.245748 -1.030267 -1.488428
C  0.113344 0.003717 0.765779
C  1.429211 -0.005204 -0.026751
C  -2.874348 2.046826 0.108197
C  -2.560666 -2.052368 1.210753
H  0.158006 -0.862849 1.43371
H  -0.085575 1.932928 1.053915
H  -3.872041 1.676339 -0.119664
H  -2.784697 3.070094 -0.246278
H  -2.713542 2.031321 1.184449
H  -1.77491 -2.251213 1.939204
H  -2.462867 -2.742093 0.37353
H  -3.528825 -2.200588 1.680617
elementType: Cl P O C H
totalener: -2180.27213407 hartree
nucrepener: 1346.47736746 hartree
electener: -3526.74950153 hartree
oneelecener: -5688.79631592 hartree
twoeener: 2162.04681438 hartree
cpcmener: -0.03605747 hartree
kineticenergy: 2175.62801492 hartree
xcener: -121.428880372853 hartree
chargesum: 0.0000000
charge: -0.050289 -0.045860 -0.036081 0.836591 -0.362353 -0.348934 -0.373657 -0.622026 0.001248 0.084314 -0.109497 -0.113628 0.147400 0.246339 0.128511 0.130739 0.118176 0.121982 0.117637 0.129388
qa: -0.0503 -0.0459 -0.0361 0.8366 -0.3624 -0.3489 -0.3737 -0.6220 0.0012 0.0843 -0.1095 -0.1136 0.1474 0.2463 0.1285 0.1307 0.1182 0.1220 0.1176 0.1294
va: 1.2575 1.2478 1.2607 5.3706 2.0640 2.0709 2.0457 1.9769 3.9417 4.5120 3.8220 3.8461 1.0106 1.0009 0.9922 0.9889 0.9959 0.9837 0.9982 0.9889
dispcorr: -0.009624898 hartree
energy: -2180.281758971288
dipole: -22.81404 21.53447 -1.27957 0.75235 -0.12447 0.62789 8.48516 -6.48925 1.99591
magnitude: 2.45259 au
magnitude: 6.23399 debye
