program: Orca
programVersion: 5.0.2
elementType: Cl Cl Cl P O O O O C C C C H H H H H H H H
charge: 0
multiplicity: 1
keywords: wb97x-d3
keywords: def2-TZVPP
keywords: def2/J RIJCOSX
keywords: DEFGRID2
keywords: scfconv7
keywords: smallprint printgap noloewdin
keywords: NOSOSCF
formula: C4H8Cl3O4P
InChI: InChI=1/C4H8Cl3O4P/c1-10-12(9,11-2)3(8)4(5,6)7/h3,8H,1-2H3
20 atoms
Cl 1.427756 -0.804578 -1.432991
Cl 2.929567 0.602713 0.577015
Cl 1.070122 -1.430827 1.366014
P  -1.417076 0.424123 -0.282025
O  -2.290051 1.335289 0.687909
O  -1.737994 -1.052205 0.215216
O  0.614177 2.097233 -0.387668
O  -1.587248 0.656528 -1.738981
C  0.267429 0.939526 0.30918
C  1.3634 -0.132408 0.207614
C  -3.708744 1.452513 0.501546
C  -1.764175 -2.203935 -0.638621
H  0.194368 1.203949 1.367539
H  0.536349 1.954968 -1.34101
H  -4.215325 0.543236 0.823174
H  -3.959323 1.660505 -0.538274
H  -4.037266 2.283767 1.118826
H  -1.763952 -1.935055 -1.693284
H  -2.674021 -2.756301 -0.416003
H  -0.901759 -2.831846 -0.424881
elementType: Cl P O C H
totalener: -2180.27283314 hartree
nucrepener: 1351.57208088 hartree
electener: -3531.84491402 hartree
oneelecener: -5698.88330072 hartree
twoeener: 2167.03838670 hartree
cpcmener: -0.02596427 hartree
kineticenergy: 2175.64377797 hartree
xcener: -121.430736885274 hartree
chargesum: -0.0000000
charge: -0.046264 -0.041264 -0.037880 0.820010 -0.349058 -0.352533 -0.368501 -0.643581 0.032149 0.081605 -0.119131 -0.086968 0.151736 0.243235 0.124614 0.115840 0.129870 0.116259 0.132155 0.097710
qa: -0.0463 -0.0413 -0.0379 0.8200 -0.3491 -0.3525 -0.3685 -0.6436 0.0321 0.0816 -0.1191 -0.0870 0.1517 0.2432 0.1246 0.1158 0.1299 0.1163 0.1322 0.0977
va: 1.2642 1.2506 1.2592 5.3711 2.1184 2.0694 2.0499 1.9350 3.9566 4.4944 3.8439 3.8243 1.0156 1.0102 0.9885 0.9956 0.9881 0.9998 0.9929 0.9968
dispcorr: -0.009860586 hartree
energy: -2180.282693725556
dipole: -21.92915 20.74013 -1.18902 1.92539 -2.80643 -0.88104 -1.41670 2.10603 0.68932
magnitude: 1.63254 au
magnitude: 4.14958 debye
