program: Gaussian 09
title: 000066960
version: EM64L-G09RevD.01
frameworkgroup: C1[X(C5H12ClN)]
method: RPBEPBE
basis: SDD
operation: Freq
keyword: #p
keyword: freq=noraman
keyword: PBEPBE/SDD
title: #p freq=noraman PBEPBE/SDD
converged: YES YES NO NO
title: Mulliken charges:
elementType: Cl N C C C C C H H H H H H H H H H H H
charge: -0.078576 -0.081020 -0.323585 -0.336132 -0.590172 -0.624501 -0.612499 0.174554 0.205260 0.238644 0.229728 0.259569 0.255549 0.237819 0.185847 0.222358 0.224477 0.187615 0.225065
chargesum: 0.00000
title: Mulliken charges with hydrogens summed into heavy atoms:
elementType: Cl N C C C C C
charge: -0.078576 -0.081020 0.056230 0.132241 -0.075054 0.021523 0.024657
polarizability: 9.26396498e+01 4.82389687e+00 6.43644724e+01 -1.50591803e+00 -1.28084258e+00 5.53078936e+01
1716.lowfreq: -23.7898 -5.2298 -0.0024 -0.0022 -0.0010 2.4689 51.9318 71.4758 104.7749
frequency: 51.8865 71.4139 104.7612 133.6228 224.1772 227.9824 259.2955 302.6205 333.5393 432.1843 470.9423 669.7198 768.0402 817.8832 848.9613 1013.1947 1032.6959 1044.6604 1055.9238 1070.4296 1090.5266 1119.6636 1152.5430 1209.5721 1250.3401 1265.2604 1273.8295 1296.9959 1320.7840 1373.3721 1417.9870 1441.4977 1457.1054 1461.0560 1462.9845 1475.6772 1478.8145 1481.7588 1488.4403 2818.0022 2844.7342 2861.6455 2999.5788 3014.0192 3019.6165 3032.3974 3046.5012 3076.0461 3078.6847 3088.8652 3129.2919
redmass: 2.5879 2.3989 3.9677 2.2121 1.2322 1.2631 2.7738 2.6842 2.2425 2.3759 2.8919 6.4681 1.0962 4.2523 1.2470 2.6224 1.5425 1.3450 3.1388 2.6450 1.3096 1.2575 1.6378 1.7581 1.5092 2.1193 1.1900 1.1984 1.3778 1.3709 1.1420 1.1579 1.0945 1.0585 1.0680 1.0666 1.0529 1.0767 1.0707 1.0702 1.0573 1.0573 1.0851 1.0610 1.0724 1.0719 1.0563 1.1036 1.1014 1.1004 1.1113
irintensity: 1.3317 0.1949 0.9296 1.8533 0.3473 0.7016 3.8584 5.3246 9.4334 2.7751 8.1035 37.0003 6.2038 32.0034 1.1348 6.4948 17.0796 2.1233 6.7532 26.2763 6.1969 6.1064 7.6517 8.0362 9.8430 6.6690 2.7486 5.3284 27.4763 12.5922 2.7705 2.8928 3.9366 11.2115 14.4181 4.0499 14.3791 6.1050 22.4087 79.0057 74.4851 222.0506 21.3263 13.5756 45.1557 41.1985 33.7717 8.0240 40.5201 39.0063 28.6794
temp: 298.150 k
press: 1.00000 atm
elementType: 17 7 6 6 6 6 6 1 1 1 1 1 1 1 1 1 1 1 1
symmnumber: 1
zpe: 433416.2 jmol-1
zpe.correction: 0.165080 hartree
zpe.thermalcorrener: 0.174484 hartree
zpe.thermalcorrenthalpy: 0.175429 hartree
zpe.thermalcorrgfe: 0.129756 hartree
zpe.sumelectzpe: -711.918399 hartree
zpe.sumelectthermal: -711.908994 hartree
zpe.sumelectthermalent: -711.908050 hartree
zpe.sumelectthermalfe: -711.953722 hartree
dipole: -2.6841 -1.0208 1.2485
dipole: 3.1314
quadrupole: -58.5494 -49.2131 -53.2543
quadrupole: -1.8695 -0.3611 0.2335
quadrupole: -4.8771 4.4592 0.4180 -1.8695 -0.3611 0.2335
hfenergy: -712.0834783 hartree
pointgroup: C01 [X(C5H12Cl1N1)]
dipole: 1.0352363 0.3953494 0.5382854 debye
dipolederiv: -0.6684065 -0.0784991 -0.0608787 -0.1748555 -0.2390631 -0.0315751 -0.0923482 -0.0236755 -0.2048485 -0.657441 -0.0205156 -0.0479606 -0.0276417 -0.5089908 -0.0007982 -0.0185866 0.0027529 -0.5780118 0.4627584 -0.1382772 -0.0807316 -0.0410138 0.1817417 0.0488486 0.001503 0.0375172 0.4795944 -0.2650195 0.0026259 -0.0098279 -0.0826269 0.0152102 -0.0493247 -0.0228754 -0.0694167 0.0594318 0.7763962 0.1720087 0.1059486 0.1614206 0.2786412 0.0335861 0.0720436 0.0330866 0.2425663 0.0560369 -0.0548897 0.0578361 -0.078098 0.3573966 -0.0980672 0.0911672 -0.0929825 0.4019977 0.3354925 0.1726323 0.0773731 0.2505068 0.2042251 0.0504714 0.0868748 0.0504203 0.3601519 -0.0666445 0.0209188 -0.0259789 0.009703 0.0350793 -0.0037644 0.0904118 -0.0965677 -0.2989156 0.0594567 0.0149585 0.008926 0.0351522 -0.1697558 0.0536916 0.0072486 0.0771075 0.0376346 0.0823927 0.0028562 0.0154897 0.0159087 0.0698134 -0.0400499 0.0007743 -0.0373597 -0.1063428 0.0844553 -0.0068081 -0.0015679 0.0040978 -0.1060325 0.0679001 0.0008713 0.0780707 0.0393955 -0.0242271 -0.0600612 -0.0156687 -0.008312 -0.1029473 0.0570869 -0.0294354 0.0801439 0.043562 -0.0118502 -0.0489302 -0.0357328 -0.0250607 0.0507602 -0.0470793 0.0124164 -0.0715867 -0.1167817 -0.0263776 -0.1683191 -0.0537945 -0.128956 -0.0178339 -0.0142308 -0.0630055 -0.0046081 0.057082 0.0644981 0.0289174 -0.0255622 0.0144962 -0.0324542 -0.0280091 -0.0769229 0.1543749 -0.287956 -0.1148513 0.1401876 0.0805524 0.0696045 0.0548722 -0.0132574 0.091785 -0.0280658 0.0392391 -0.1353375 0.0379551 0.0783341 0.1145673 0.0552796 -0.0711258 0.0855873 -0.0591062 0.0400565 -0.0435695 -0.0740569 -0.0232931 -0.0842064 0.0213806 -0.0106918 -0.2012149 -0.1185294 -0.2545076 0.092238 0.0572964 -0.0434634 -0.0246859 -0.1473226 0.096389 -0.0362945 0.0884243 0.0466522 unknown
polarizability: 92.4454212|4.7829977|64.336019|3.0264979|1.6143404|55.5305755 unknown
InChI: InChI=1S/C5H12ClN/c1-7(2)5-3-4-6/h3-5H2,1-2H3
charge 0 multiplicity 1
19 atoms
Cl -3.727157 -0.257835 -0.26162
N  1.608521 -0.079192 -0.251302
C  0.387166 0.553105 0.298412
C  -0.909189 -0.166025 -0.149885
C  -2.139771 0.664266 0.213839
C  1.830343 -1.453735 0.24265
C  2.800375 0.772576 -0.055246
H  0.413645 0.604326 1.420691
H  0.363827 1.598291 -0.069653
H  -0.866029 -0.322262 -1.242673
H  -0.991897 -1.158619 0.328056
H  -2.188122 1.616241 -0.337157
H  -2.22925 0.844438 1.296818
H  0.992853 -2.109373 -0.049052
H  1.945902 -1.508588 1.356103
H  2.748148 -1.86234 -0.216007
H  3.671654 0.309607 -0.551901
H  3.063186 0.932825 1.02194
H  2.631596 1.762093 -0.516712
