program: Orca
programVersion: 5.0.2
elementType: Cl Cl Cl P O O O O C C C C H H H H H H H H
charge: 0
multiplicity: 1
keywords: wb97x-d3
keywords: def2-TZVPP
keywords: def2/J RIJCOSX
keywords: DEFGRID2
keywords: scfconv7
keywords: smallprint printgap noloewdin
keywords: NOSOSCF
formula: C4H8Cl3O4P
InChI: InChI=1/C4H8Cl3O4P/c1-10-12(9,11-2)3(8)4(5,6)7/h3,8H,1-2H3
20 atoms
Cl 1.025863 1.566997 -1.068916
Cl 2.842902 0.676284 0.975362
Cl 1.911434 -1.17947 -1.003331
P  -1.312146 -0.525329 0.01442
O  -2.034966 0.896168 -0.087263
O  -2.063514 -1.236517 1.226841
O  0.062983 0.81469 1.880207
O  -1.235962 -1.282924 -1.257567
C  0.27679 -0.155786 0.904863
C  1.454411 0.204441 -0.013953
C  -2.387995 1.537432 -1.3194
C  -3.443675 -1.611215 1.097595
H  0.564617 -1.075227 1.424132
H  -0.300725 1.620291 1.489978
H  -1.957696 2.535125 -1.323913
H  -3.471622 1.612459 -1.367699
H  -2.03297 0.990092 -2.18986
H  -3.695949 -2.188191 1.982613
H  -3.606385 -2.226998 0.213425
H  -4.083461 -0.730604 1.05067
elementType: Cl P O C H
totalener: -2180.27355329 hartree
nucrepener: 1347.21443396 hartree
electener: -3527.48798725 hartree
oneelecener: -5690.31414795 hartree
twoeener: 2162.82616070 hartree
cpcmener: -0.02990854 hartree
kineticenergy: 2175.63742265 hartree
xcener: -121.429502289872 hartree
chargesum: 0.0000000
charge: -0.051704 -0.041947 -0.034687 0.820031 -0.359436 -0.350139 -0.368973 -0.629200 0.029471 0.081362 -0.100765 -0.124040 0.150272 0.243616 0.118966 0.127035 0.116629 0.129825 0.118610 0.125075
qa: -0.0517 -0.0419 -0.0347 0.8200 -0.3594 -0.3501 -0.3690 -0.6292 0.0295 0.0814 -0.1008 -0.1240 0.1503 0.2436 0.1190 0.1270 0.1166 0.1298 0.1186 0.1251
va: 1.2562 1.2514 1.2656 5.3816 2.0530 2.1155 2.0486 1.9575 3.9740 4.5034 3.8289 3.8441 1.0144 1.0077 0.9847 0.9924 1.0009 0.9886 0.9925 0.9898
dispcorr: -0.009627844 hartree
energy: -2180.283181138695
dipole: -24.22191 22.59426 -1.62766 -0.55653 1.57016 1.01362 2.69514 -2.27222 0.42292
magnitude: 1.96356 au
magnitude: 4.99097 debye
