program: Orca
programVersion: 5.0.2
elementType: Cl Cl Cl P O O O O C C C C H H H H H H H H
charge: 0
multiplicity: 1
keywords: wb97x-d3
keywords: def2-TZVPP
keywords: def2/J RIJCOSX
keywords: DEFGRID2
keywords: scfconv7
keywords: smallprint printgap noloewdin
keywords: NOSOSCF
formula: C4H8Cl3O4P
InChI: InChI=1/C4H8Cl3O4P/c1-10-12(9,11-2)3(8)4(5,6)7/h3,8H,1-2H3
20 atoms
Cl 1.874178 0.175647 -1.596591
Cl 2.733851 0.669984 1.094354
Cl 1.218577 -1.703142 0.491986
P  -1.408333 0.05918 -0.332958
O  -2.478278 1.232061 -0.190631
O  -1.806442 -1.041396 0.745377
O  0.275451 2.136144 0.082433
O  -1.302201 -0.380854 -1.742501
C  0.131581 0.789763 0.411241
C  1.41973 0.007824 0.104995
C  -2.938293 1.745977 1.065184
C  -2.314109 -2.337415 0.404204
H  -0.00502 0.740042 1.496186
H  0.276935 2.263465 -0.875235
H  -3.394907 0.964967 1.670368
H  -3.687733 2.498421 0.838306
H  -2.130119 2.213316 1.625883
H  -1.947264 -3.034311 1.151878
H  -1.980427 -2.66272 -0.579058
H  -3.401434 -2.322091 0.4266
elementType: Cl P O C H
totalener: -2180.27255414 hartree
nucrepener: 1348.43473010 hartree
electener: -3528.70728424 hartree
oneelecener: -5692.64095687 hartree
twoeener: 2163.93367263 hartree
cpcmener: -0.03316408 hartree
kineticenergy: 2175.64059542 hartree
xcener: -121.431204669866 hartree
chargesum: -0.0000000
charge: -0.048530 -0.050414 -0.040996 0.838511 -0.358213 -0.355113 -0.380562 -0.635819 0.019647 0.088610 -0.112934 -0.101692 0.152319 0.241559 0.120045 0.130583 0.119822 0.126414 0.115489 0.131274
qa: -0.0485 -0.0504 -0.0410 0.8385 -0.3582 -0.3551 -0.3806 -0.6358 0.0196 0.0886 -0.1129 -0.1017 0.1523 0.2416 0.1200 0.1306 0.1198 0.1264 0.1155 0.1313
va: 1.2563 1.2401 1.2637 5.3814 2.0763 2.0549 2.0362 1.9657 3.9032 4.5524 3.8498 3.8150 1.0117 1.0059 0.9927 0.9888 0.9892 0.9860 1.0025 0.9916
dispcorr: -0.009759098 hartree
energy: -2180.282313234894
dipole: -22.08066 20.91838 -1.16228 1.68845 -1.70159 -0.01314 5.68080 -3.77682 1.90398
magnitude: 2.23074 au
magnitude: 5.67009 debye
