program: Orca
programVersion: 5.0.2
elementType: Cl Cl Cl P O O O O C C C C H H H H H H H H
charge: 0
multiplicity: 1
keywords: wb97x-d3
keywords: def2-TZVPP
keywords: def2/J RIJCOSX
keywords: DEFGRID2
keywords: scfconv7
keywords: smallprint printgap noloewdin
keywords: NOSOSCF
formula: C4H8Cl3O4P
InChI: InChI=1/C4H8Cl3O4P/c1-10-12(9,11-2)3(8)4(5,6)7/h3,8H,1-2H3
20 atoms
Cl 0.994094 1.980254 -0.250583
Cl 3.050207 0.147813 0.53756
Cl 1.403999 -0.449568 -1.749906
P  -1.263172 -0.752116 0.105712
O  -1.813054 0.645782 -0.431568
O  -2.03881 -0.941136 1.482056
O  0.35939 0.196157 2.007209
O  -1.35053 -1.874152 -0.857118
C  0.444264 -0.47877 0.798607
C  1.408221 0.268947 -0.138208
C  -2.030265 0.936396 -1.815295
C  -3.433033 -1.267832 1.490557
H  0.847095 -1.494622 0.906983
H  0.993623 -0.175123 2.631017
H  -1.258994 1.616641 -2.172658
H  -3.001013 1.420536 -1.901922
H  -2.030456 0.038507 -2.431436
H  -4.033353 -0.426004 1.144283
H  -3.69675 -1.4897 2.521854
H  -3.645027 -2.142632 0.875248
elementType: Cl P O C H
totalener: -2180.27538146 hartree
nucrepener: 1351.62560733 hartree
electener: -3531.90098879 hartree
oneelecener: -5699.53153782 hartree
twoeener: 2167.63054903 hartree
cpcmener: -0.02735171 hartree
kineticenergy: 2175.65316742 hartree
xcener: -121.431754775635 hartree
chargesum: 0.0000000
charge: -0.044122 -0.059976 -0.034762 0.803446 -0.350785 -0.342785 -0.365274 -0.613990 0.038918 0.087117 -0.085238 -0.124497 0.145029 0.246688 0.095584 0.127067 0.113398 0.121815 0.126747 0.115621
qa: -0.0441 -0.0600 -0.0348 0.8034 -0.3508 -0.3428 -0.3653 -0.6140 0.0389 0.0871 -0.0852 -0.1245 0.1450 0.2467 0.0956 0.1271 0.1134 0.1218 0.1267 0.1156
va: 1.2526 1.2353 1.2734 5.3515 2.0614 2.1184 2.0500 1.9697 3.9673 4.4919 3.8268 3.8549 1.0038 1.0029 0.9974 0.9919 1.0040 0.9887 0.9884 0.9951
dispcorr: -0.009737536 hartree
energy: -2180.285118997179
dipole: -21.27924 20.74933 -0.52991 -4.05190 4.26370 0.21180 3.45752 -2.68539 0.77213
magnitude: 0.96013 au
magnitude: 2.44046 debye
