program: Orca
programVersion: 5.0.2
elementType: Cl Cl Cl P O O O O C C C C H H H H H H H H
charge: 0
multiplicity: 1
keywords: wb97x-d3
keywords: def2-TZVPP
keywords: def2/J RIJCOSX
keywords: DEFGRID2
keywords: scfconv7
keywords: smallprint printgap noloewdin
keywords: NOSOSCF
formula: C4H8Cl3O4P
InChI: InChI=1/C4H8Cl3O4P/c1-10-12(9,11-2)3(8)4(5,6)7/h3,8H,1-2H3
20 atoms
Cl 2.780744 1.192268 -0.347132
Cl 1.668003 -0.732916 1.463162
Cl 1.377782 -1.097108 -1.387685
P  -1.479304 -0.030581 -0.07579
O  -2.489295 0.908809 0.734231
O  -1.259315 -1.241085 0.919781
O  0.045388 1.822386 -1.092143
O  -1.902538 -0.346776 -1.461767
C  0.116294 0.914986 -0.040223
C  1.416936 0.093481 -0.074671
C  -3.159078 2.00664 0.10265
C  -2.233798 -2.285891 1.060235
H  0.149068 1.496548 0.885238
H  -0.166185 1.371241 -1.921212
H  -3.507114 1.748563 -0.897367
H  -2.504202 2.875794 0.043783
H  -4.019102 2.252766 0.720848
H  -1.750941 -3.089994 1.609354
H  -2.559347 -2.6620 0.090595
H  -3.097378 -1.933669 1.624189
elementType: Cl P O C H
totalener: -2180.27822810 hartree
nucrepener: 1344.45556038 hartree
electener: -3524.73378848 hartree
oneelecener: -5684.79806615 hartree
twoeener: 2160.06427767 hartree
cpcmener: -0.02161781 hartree
kineticenergy: 2175.64898569 hartree
xcener: -121.428243416733 hartree
chargesum: -0.0000000
charge: -0.045746 -0.039564 -0.049231 0.825271 -0.355961 -0.340153 -0.359947 -0.617297 0.019458 0.083876 -0.111191 -0.116543 0.144590 0.236952 0.114112 0.117542 0.126519 0.125038 0.117524 0.124749
qa: -0.0457 -0.0396 -0.0492 0.8253 -0.3560 -0.3402 -0.3599 -0.6173 0.0195 0.0839 -0.1112 -0.1165 0.1446 0.2370 0.1141 0.1175 0.1265 0.1250 0.1175 0.1247
va: 1.2476 1.2549 1.2594 5.3981 2.0740 2.1205 2.0519 1.9706 3.9435 4.5197 3.8464 3.8443 1.0137 1.0166 0.9994 0.9905 0.9894 0.9883 0.9947 0.9896
dispcorr: -0.009509397 hartree
energy: -2180.287737497128
dipole: -23.03064 21.93415 -1.09649 2.77497 -2.58432 0.19064 2.56052 -1.54444 1.01608
magnitude: 1.50700 au
magnitude: 3.83050 debye
