program: Gaussian 09
title: 000066952
version: EM64L-G09RevD.01
frameworkgroup: C1[X(C6H9N3)]
method: RPBEPBE
basis: SDD
operation: Freq
keyword: #p
keyword: freq=noraman
keyword: PBEPBE/SDD
title: #p freq=noraman PBEPBE/SDD
converged: NO YES NO YES
title: Mulliken charges:
elementType: N N N C C C C C C H H H H H H H H H
charge: -0.725549 -0.725438 -0.725571 0.628729 0.628645 0.628977 -0.697617 -0.697728 -0.697510 0.199387 0.199505 0.199373 0.297472 0.297475 0.297456 0.297472 0.297454 0.297467
chargesum: 0.00000
title: Mulliken charges with hydrogens summed into heavy atoms:
elementType: N N N C C C C C C
charge: -0.130602 -0.130510 -0.130651 0.628729 0.628645 0.628977 -0.498229 -0.498223 -0.498137
polarizability: 1.13545768e+02 1.39702243e-04 1.13535992e+02 3.68644736e-03 4.01039561e-03 3.92834866e+01
1716.lowfreq: -5.3264 -0.0008 -0.0006 -0.0005 10.1382 14.6491 199.2673 219.0450 219.9475
frequency: 199.2665 219.0430 219.9443 279.1731 281.7387 298.2283 301.9730 302.8707 339.6376 341.3669 374.5918 490.9663 511.2842 511.5707 600.2691 619.0912 619.7344 674.1949 780.0348 781.1095 883.1243 972.2275 972.8021 973.1547 1066.2834 1071.8326 1072.1718 1215.2937 1215.6560 1304.5179 1410.7286 1433.1199 1506.7504 1507.0898 1628.3249 1628.7106 1634.1791 1634.7933 1640.2990 3111.4601 3112.0952 3119.5913 3574.6847 3574.8963 3575.8076 3718.8889 3719.1300 3719.2354
redmass: 4.1284 3.0354 3.0322 1.2793 1.2738 1.2747 2.8999 2.9049 1.0285 1.0289 1.0079 2.3307 6.1012 6.0989 5.8414 2.9071 2.9206 1.1872 1.7751 1.7673 4.8083 1.9981 1.9916 6.2185 1.2933 1.5731 1.5805 1.7759 1.7752 1.3085 8.2913 5.8664 3.7775 3.7974 3.3137 3.0564 1.4208 1.3711 1.1881 1.0908 1.0908 1.0919 1.0442 1.0442 1.0445 1.1042 1.1042 1.1042
irintensity: 44.8700 0.0011 0.0387 7.4260 0.2474 860.5495 3.3821 3.3450 0.6210 0.1351 0.6903 0.0004 0.1048 0.1121 0.0000 0.0026 0.0034 67.1319 0.0004 0.0004 179.8724 7.7510 7.9270 0.0625 0.0141 5.3500 5.5293 94.4197 95.5015 0.0173 0.0013 0.0001 27.3693 27.9210 178.8396 155.5671 472.8417 448.1725 2.2407 33.8130 33.6959 0.1210 68.0269 67.6804 1.5748 12.8304 15.2967 20.5984
temp: 298.150 k
press: 1.00000 atm
elementType: 7 7 7 6 6 6 6 6 6 1 1 1 1 1 1 1 1 1
symmnumber: 1
zpe: 387248.8 jmol-1
zpe.correction: 0.147495 hartree
zpe.thermalcorrener: 0.156935 hartree
zpe.thermalcorrenthalpy: 0.157879 hartree
zpe.thermalcorrgfe: 0.114549 hartree
zpe.sumelectzpe: -397.636909 hartree
zpe.sumelectthermal: -397.627469 hartree
zpe.sumelectthermalent: -397.626525 hartree
zpe.sumelectthermalfe: -397.669854 hartree
dipole: 0.0005 0.0002 0.0013
dipole: 0.0014
quadrupole: -36.6036 -36.6083 -62.1066
quadrupole: 0.0000 0.0110 0.0097
quadrupole: 8.5026 8.4978 -17.0004 0.0000 0.0110 0.0097
hfenergy: -397.7844039 hartree
pointgroup: C01 [X(C6H9N3)]
dipole: -0.0002095 -0.0000091 -0.0005192 debye
dipolederiv: -0.2555986 0.3588102 0.0000822 0.3589518 -1.3887918 -0.0002456 0.0002264 -0.0007149 -0.7737717 -0.7950394 -0.6700173 0.000224 -0.6700972 -0.8492707 0.0001757 0.0005938 0.0005495 -0.7737772 -1.4156934 0.3112212 0.0002594 0.3111982 -0.2280797 -0.0000537 0.0008505 -0.0001993 -0.7743534 0.7289318 -0.2589244 -0.0000118 -0.2590645 1.5467059 0.0000951 0.0000015 0.000051 0.2254203 1.1181764 0.4838145 -0.0000761 0.4834767 1.1570997 -0.0000924 -0.0000428 -0.0000594 0.2256634 1.5659317 -0.2246784 -0.0000629 -0.2246762 0.708711 0.0000078 -0.0000057 -0.0000068 0.2255976 -0.2230075 -0.1691736 0.0000018 -0.1691424 -0.8675035 0.0000024 -0.0000486 0.0000198 -0.4245966 -0.5599492 0.3635951 -0.0000069 0.3635575 -0.5305938 0.0000384 -0.0000433 0.0000487 -0.4247537 -0.8528098 -0.1947329 -0.0000174 -0.1947585 -0.2375205 -0.000038 -0.0000656 -0.000037 -0.4250544 -0.1590885 0.0500829 -0.000028 0.0502705 0.0320548 0.000008 0.0000031 -0.0000003 0.2030043 -0.0591177 -0.1078945 -0.0000102 -0.1077385 -0.067745 -0.0000068 -0.0000163 0.0000007 0.2033555 0.0276611 0.0578576 -0.0000063 0.057817 -0.154569 0.0000198 -0.0000194 0.0000186 0.2033042 0.1051309 -0.0211903 0.0000377 -0.0208176 0.1880541 0.0000832 0.0000229 0.0003457 0.3850487 0.1098424 -0.028267 -0.0000896 -0.028709 0.1833392 0.0000467 -0.0002189 0.0002622 0.3847948 0.1491624 0.0462156 -0.0001122 0.0466883 0.1440653 0.0000101 -0.0003448 -0.0001351 0.3845317 0.1402787 0.0462436 -0.0000106 0.0458458 0.1529348 -0.0000867 -0.0001475 -0.0003208 0.385185 0.1855051 -0.0256402 -0.0000686 -0.0251367 0.1075973 0.000094 -0.0003314 0.0002323 0.3852601 0.1896838 -0.017322 -0.0001044 -0.0176651 0.1035119 -0.000058 -0.0004139 -0.000055 0.3851415 unknown
polarizability: 113.5437537|0.0039564|113.5380067|0.0051321|-0.0018261|39.2834866 unknown
InChI: InChI=1S/C6H9N3/c7-4-1-5(8)3-6(9)2-4/h1-3H,7-9H2
charge 0 multiplicity 1
18 atoms
N  -0.785006 2.707831 -0.00005
N  -1.952817 -2.033692 -0.000008
N  2.737504 -0.674176 0.000055
C  -0.394449 1.361407 -0.00008
C  -0.981876 -1.022532 -0.000063
C  1.376281 -0.338947 0.000059
C  -1.381488 0.340232 -0.000135
C  0.985699 1.026433 0.000006
C  0.396008 -1.366601 0.000027
H  -2.447163 0.602678 -0.000163
H  1.745934 1.817959 0.000029
H  0.70184 -2.420712 0.000079
H  -0.090348 3.447378 -0.000488
H  -1.767587 2.960847 -0.000521
H  -2.940552 -1.801637 -0.000536
H  -1.680973 -3.011213 -0.000426
H  3.030682 -1.645535 0.000596
H  3.448011 0.050184 0.00062
