program: Orca
programVersion: 5.0.2
elementType: Cl Cl Cl P O O O O C C C C H H H H H H H H
charge: 0
multiplicity: 1
keywords: wb97x-d3
keywords: def2-TZVPP
keywords: def2/J RIJCOSX
keywords: DEFGRID2
keywords: scfconv7
keywords: smallprint printgap noloewdin
keywords: NOSOSCF
formula: C4H8Cl3O4P
InChI: InChI=1/C4H8Cl3O4P/c1-10-12(9,11-2)3(8)4(5,6)7/h3,8H,1-2H3
20 atoms
Cl 1.801251 0.209854 -1.516803
Cl 2.672942 0.243216 1.21395
Cl 1.171726 -2.00588 0.21676
P  -1.481402 -0.046642 -0.333799
O  -2.561449 0.939686 0.305483
O  -1.955668 -1.459327 0.217741
O  0.185203 1.817734 0.395073
O  -1.366263 -0.032534 -1.805493
C  0.064986 0.442802 0.577634
C  1.355652 -0.251105 0.122598
C  -2.831287 2.248659 -0.205469
C  -2.187852 -1.769395 1.593799
H  -0.079767 0.174705 1.632144
H  0.403538 2.241586 1.232599
H  -3.910694 2.353569 -0.295292
H  -2.384837 2.414386 -1.18477
H  -2.457193 2.996622 0.490264
H  -2.772263 -2.685871 1.61614
H  -2.746677 -0.985507 2.104231
H  -1.247903 -1.942469 2.118361
elementType: Cl P O C H
totalener: -2180.27633744 hartree
nucrepener: 1349.49508885 hartree
electener: -3529.77142629 hartree
oneelecener: -5695.06709093 hartree
twoeener: 2165.29566464 hartree
cpcmener: -0.03439730 hartree
kineticenergy: 2175.64725614 hartree
xcener: -121.432069466226 hartree
chargesum: 0.0000000
charge: -0.036312 -0.064201 -0.044136 0.826992 -0.354275 -0.337555 -0.378394 -0.602977 -0.031649 0.109773 -0.097451 -0.102986 0.161750 0.254560 0.123451 0.112364 0.109698 0.131049 0.123214 0.097086
qa: -0.0363 -0.0642 -0.0441 0.8270 -0.3543 -0.3376 -0.3784 -0.6030 -0.0316 0.1098 -0.0975 -0.1030 0.1617 0.2546 0.1235 0.1124 0.1097 0.1310 0.1232 0.0971
va: 1.2627 1.2316 1.2622 5.3804 2.0714 2.0735 2.0424 2.0081 3.9462 4.4753 3.8509 3.8478 0.9983 0.9960 0.9906 1.0021 0.9932 0.9892 0.9941 0.9951
dispcorr: -0.009884553 hartree
energy: -2180.286221993349
dipole: -20.64198 19.96568 -0.67630 6.67154 -5.78143 0.89011 7.58328 -4.40724 3.17604
magnitude: 3.36704 au
magnitude: 8.55833 debye
