program: Orca
programVersion: 5.0.2
elementType: Cl Cl Cl P O O O O C C C C H H H H H H H H
charge: 0
multiplicity: 1
keywords: wb97x-d3
keywords: def2-TZVPP
keywords: def2/J RIJCOSX
keywords: DEFGRID2
keywords: scfconv7
keywords: smallprint printgap noloewdin
keywords: NOSOSCF
formula: C4H8Cl3O4P
InChI: InChI=1/C4H8Cl3O4P/c1-10-12(9,11-2)3(8)4(5,6)7/h3,8H,1-2H3
20 atoms
Cl 0.946534 1.99251 -0.133894
Cl 3.030314 0.134878 0.514468
Cl 1.333247 -0.359438 -1.760274
P  -1.287982 -0.780873 0.109436
O  -1.832453 0.621897 -0.423561
O  -2.054961 -0.949759 1.494064
O  0.463652 -0.032839 2.08996
O  -1.390924 -1.905384 -0.848473
C  0.431249 -0.525346 0.797188
C  1.379148 0.273524 -0.11411
C  -2.038341 0.930202 -1.805057
C  -3.434258 -1.335832 1.522185
H  0.839505 -1.541508 0.834804
H  0.007159 0.814856 2.155411
H  -2.006147 0.04354 -2.436295
H  -1.280485 1.637088 -2.138639
H  -3.020135 1.390471 -1.898053
H  -3.660864 -1.619995 2.546964
H  -3.627683 -2.186741 0.868748
H  -4.075484 -0.50281 1.232982
elementType: Cl P O C H
totalener: -2180.27591696 hartree
nucrepener: 1351.41332398 hartree
electener: -3531.68924094 hartree
oneelecener: -5698.46784244 hartree
twoeener: 2166.77860150 hartree
cpcmener: -0.02424592 hartree
kineticenergy: 2175.64599845 hartree
xcener: -121.429912250375 hartree
chargesum: 0.0000000
charge: -0.051469 -0.045658 -0.031812 0.786910 -0.348845 -0.345129 -0.356098 -0.611234 0.068364 0.070284 -0.085460 -0.122599 0.139190 0.232813 0.114567 0.094893 0.127949 0.127106 0.115163 0.121066
qa: -0.0515 -0.0457 -0.0318 0.7869 -0.3488 -0.3451 -0.3561 -0.6112 0.0684 0.0703 -0.0855 -0.1226 0.1392 0.2328 0.1146 0.0949 0.1279 0.1271 0.1152 0.1211
va: 1.2520 1.2435 1.2779 5.3773 2.0565 2.1229 2.0663 1.9744 3.9336 4.5270 3.8290 3.8532 1.0150 1.0151 1.0025 0.9961 0.9924 0.9883 0.9962 0.9889
dispcorr: -0.009885536 hartree
energy: -2180.285802499019
dipole: -21.93838 20.60960 -1.32877 -3.47389 4.59289 1.11900 2.90832 -2.66745 0.24088
magnitude: 1.75380 au
magnitude: 4.45781 debye
